{"text_format":"3","workbook":"xlsx","n_sheets":10,"sheets":["HOME","Dashboard","Sheet2","1-Tranche","3-Tranche","Expectancy","RBAF","Trade Plan","User Guide & Settings","Sheet1"],"not_rendered":{"charts":3,"images":23,"macros":1,"external_links":5,"defined_names":45},"read":"whole","date_system":"1900"}

{"sheet":"HOME","index":0,"n_rows":51,"n_cols":23,"rows_kept":51,"merged":[[1,8,2,15],[3,8,3,14],[5,3,5,18],[11,1,11,20],[12,5,12,16],[16,12,16,18],[19,12,19,18],[20,12,20,18],[25,12,25,18],[26,12,26,18],[50,3,50,18]]}
[]
[{"$nulls":8}," Risk Management Spreadsheet (RMS)"]
[{"$nulls":18},"Ver.7.0"]
[{"$nulls":8},"PSE Stock Trading Risk Management Spreadsheet",{"$nulls":9},{"$f":"\"Registered to \"&'1-Tranche'!$D$2","v":"Registered to Trial Version"}]
[]
[{"$nulls":3},"AA Excel Spreadsheets© 2016. All Rights Reserved.",{"$nulls":16},1,null,-1263287135]
{"$rows_left_out":36}
{"sheet":"Dashboard","index":1,"n_rows":19,"n_cols":31,"rows_kept":19,"hidden":true,"merged":[[1,3,2,6],[3,3,3,6],[5,2,5,7],[5,11,5,16],[5,22,5,27],[6,2,6,4],[6,5,6,7],[6,26,6,27],[7,2,7,4],[7,5,7,7],[7,26,7,27],[8,2,8,4],[8,5,8,7],[8,26,8,27],[10,2,10,7],[10,22,10,27],[11,2,11,4],[11,5,11,7],[11,26,11,27],[12,2,12,4],[12,5,12,7],[12,26,12,27],[13,2,13,4],[13,5,13,7],[13,26,13,27],[14,2,14,4],[14,5,14,7],[15,2,15,4],[15,5,15,7],[15,22,15,27],[16,14,16,16],[16,22,16,27],[17,2,17,4],[17,5,17,7],[17,14,17,16],[17,22,17,23],[18,14,18,16],[18,22,18,23]]}
[]
[{"$nulls":3},{"$f":"'1-Tranche'!D2:E2","v":"Trial Version"}]
[]
[{"$nulls":3},"Account Name"]
[]
[null,null,"RISK MANAGEMENT PLAN",{"$nulls":8},"EXPECTANCY CHART",{"$nulls":10},"RESULT-BASED ASSUMPTION FORECAST"]
{"$rows_left_out":14}
{"sheet":"Sheet2","index":2,"n_rows":42,"n_cols":1,"rows_kept":42,"hidden":true}
{"$rows_empty":10}
["ADJUSTED"]
["POSITION SIZE"]
[{"$f":"IF(AND(A1O=1,REGNAME=AR1I),('1-Tranche'!$D$7/('1-Tranche'!U13-'1-Tranche'!AB13)),\"\")","v":7552.641914141556}]
[{"$f":"IF(AND(A1O=1,REGNAME=AR1I),('1-Tranche'!$D$7/('1-Tranche'!U14-'1-Tranche'!AB14)),\"\")","v":1425.0901369511653}]
[{"$f":"IF(AND(A1O=1,REGNAME=AR1I),('1-Tranche'!$D$7/('1-Tranche'!U15-'1-Tranche'!AB15)),\"\")","v":9317.667228832564}]
{"$rows_left_out":28}
{"sheet":"1-Tranche","index":3,"n_rows":51,"n_cols":55,"rows_kept":51,"hidden":true,"merged":[[1,3,1,4],[1,35,1,38],[2,3,2,4],[3,3,3,4],[4,3,4,4],[5,3,5,4],[6,3,6,4],[7,3,7,4],[8,3,8,4],[8,35,8,39],[8,42,9,43],[10,1,11,1],[10,2,11,2],[10,3,11,3],[10,4,11,4],[10,5,11,5],[10,6,11,6],[10,35,11,35],[10,37,10,39],[10,40,10,41],[44,38,45,42],[47,38,48,42]]}
[1,"      RMS-V7.1"]
[null,null,"Account Name:","Trial Version",{"$nulls":31},"TOP RISK REWARD RATIO",{"$nulls":4},"RISK","REWARD","Refresh Data    ",{"$nulls":6},5]
[null,null,"Portfolio Size:",{"v":100000,"d":"100,000.00"},null,"           RRR","STOCK",{"$nulls":28},"POSITION SIZE","ENTRY","STOP","TARGET","MARKET P.","LOSS","GAIN",{"$nulls":7},10,"Exact Value","Support"]
[null,null,"Position% Per Trade:",{"v":0.4,"d":"40.00%"},null,{"$f":"IFERROR(LARGE($AN$13:$AN$42,1),\"\")","v":{"v":3.5597583184797905,"d":"3.56"}},{"$f":"IF(F4=\"\",\"\",INDEX($C$13:$C$42,MATCH(F4,$AN$13:$AN$42,0)))","v":"IRC"},{"$nulls":28},{"$f":"IF(F4=\"\",\"\",INDEX($AJ$13:$AJ$42,MATCH(F4,$AN$13:$AN$42,0)))","v":{"v":7552.641914141556,"d":"7,553"}},{"$f":"IF(F4=\"\",\"\",INDEX($D$13:$D$42,MATCH(F4,$AN$13:$AN$42,0)))","v":{"v":2.29,"d":"2.290"}},{"$f":"IF(F4=\"\",\"\",INDEX($E$13:$E$42,MATCH(F4,$AN$13:$AN$42,0)))","v":{"v":2.19,"d":"2.190"}},{"$f":"IF(F4=\"\",\"\",INDEX($F$13:$F$42,MATCH(F4,$AN$13:$AN$42,0)))","v":{"v":2.8,"d":"2.800"}},{"$f":"IF(F4=\"\",\"\",INDEX($G$13:$G$42,MATCH(F4,$AN$13:$AN$42,0)))","v":{"v":2.66,"d":"2.660"}},{"$f":"IF(F4=\"\",\"\",INDEX($AO$13:$AO$42,MATCH(F4,$AN$13:$AN$42,0)))","v":"-1,000.0 (-5.76%)"},{"$f":"IF(F4=\"\",\"\",INDEX($AP$13:$AP$42,MATCH(F4,$AN$13:$AN$42,0)))","v":"3,559.7 (20.49%)"},{"$nulls":7},100,"Board Lot","Cutloss"]
[null,null,"Position Size Per Trade:",{"$f":"D3*D4","v":{"v":40000,"d":"40,000.00"}},null,{"$f":"IFERROR(LARGE($AN$13:$AN$42,2),\"\")","v":{"v":3.5189306756240395,"d":"3.52"}},{"$f":"IF(F5=\"\",\"\",INDEX($C$13:$C$42,MATCH(F5,$AN$13:$AN$42,0)))","v":"ATN"},{"$nulls":28},{"$f":"IF(F5=\"\",\"\",INDEX($AJ$13:$AJ$42,MATCH(F5,$AN$13:$AN$42,0)))","v":{"v":9317.667228832564,"d":"9,318"}},{"$f":"IF(F5=\"\",\"\",INDEX($D$13:$D$42,MATCH(F5,$AN$13:$AN$42,0)))","v":{"v":1.25,"d":"1.250"}},{"$f":"IF(F5=\"\",\"\",INDEX($E$13:$E$42,MATCH(F5,$AN$13:$AN$42,0)))","v":{"v":1.16,"d":"1.160"}},{"$f":"IF(F5=\"\",\"\",INDEX($F$13:$F$42,MATCH(F5,$AN$13:$AN$42,0)))","v":{"v":1.65,"d":"1.650"}},{"$f":"IF(F5=\"\",\"\",INDEX($G$13:$G$42,MATCH(F5,$AN$13:$AN$42,0)))","v":{"v":1.27,"d":"1.270"}},{"$f":"IF(F5=\"\",\"\",INDEX($AO$13:$AO$42,MATCH(F5,$AN$13:$AN$42,0)))","v":"-1,000.0 (-8.55%)"},{"$f":"IF(F5=\"\",\"\",INDEX($AP$13:$AP$42,MATCH(F5,$AN$13:$AN$42,0)))","v":"3,518.6 (30.08%)"},{"$nulls":7},1000,"Risk Calculation"]
[null,null,"% to risk per trade:",{"v":0.025,"d":"2.50%"},null,{"$f":"IFERROR(LARGE($AN$13:$AN$42,3),\"\")","v":{"v":3.2032268914508886,"d":"3.20"}},{"$f":"IF(F6=\"\",\"\",INDEX($C$13:$C$42,MATCH(F6,$AN$13:$AN$42,0)))","v":"PXP"},{"$nulls":28},{"$f":"IF(F6=\"\",\"\",INDEX($AJ$13:$AJ$42,MATCH(F6,$AN$13:$AN$42,0)))","v":{"v":1425.0901369511653,"d":"1,425"}},{"$f":"IF(F6=\"\",\"\",INDEX($D$13:$D$42,MATCH(F6,$AN$13:$AN$42,0)))","v":{"v":16.88,"d":"16.880"}},{"$f":"IF(F6=\"\",\"\",INDEX($E$13:$E$42,MATCH(F6,$AN$13:$AN$42,0)))","v":{"v":16.42,"d":"16.420"}},{"$f":"IF(F6=\"\",\"\",INDEX($F$13:$F$42,MATCH(F6,$AN$13:$AN$42,0)))","v":{"v":19.4,"d":"19.400"}},{"$f":"IF(F6=\"\",\"\",INDEX($G$13:$G$42,MATCH(F6,$AN$13:$AN$42,0)))","v":{"v":16.3,"d":"16.300"}},"-1,000.0 (-4.14%)",{"$f":"IF(F6=\"\",\"\",INDEX($AP$13:$AP$42,MATCH(F6,$AN$13:$AN$42,0)))","v":"3,203.0 (13.26%)"},null,null,"Support",{"$nulls":4},10000,"Maximum Shares"]
{"$rows_left_out":19}
{"sheet":"3-Tranche","index":4,"n_rows":74,"n_cols":57,"rows_kept":74,"hidden":true,"merged":[[1,3,1,4],[2,3,2,4],[3,3,3,4],[4,3,4,4],[5,3,5,4],[6,3,6,4],[7,3,7,4],[8,3,8,4],[8,45,9,46],[10,1,11,1],[10,2,11,2],[10,3,11,3],[10,4,11,4],[10,5,11,5],[10,6,11,6],[10,7,10,8],[10,39,10,41],[10,46,11,46],[12,1,14,1],[12,2,14,2],[12,4,14,4],[12,5,14,5],[12,6,14,6],[12,39,14,39],[12,40,14,40],[12,41,14,41],[12,43,14,43],[12,45,14,45],[12,46,14,46],[15,1,17,1],[15,2,17,2],[15,4,17,4],[15,5,17,5],[15,6,17,6],[15,39,17,39],[15,40,17,40],[15,41,17,41],[15,43,17,43],[15,45,17,45],[15,46,17,46],[18,1,20,1],[18,2,20,2],[18,4,20,4],[18,5,20,5],[18,6,20,6],[18,39,20,39],[18,40,20,40],[18,41,20,41],[18,43,20,43],[18,45,20,45],[18,46,20,46],[21,1,23,1],[21,2,23,2],[21,4,23,4],[21,5,23,5],[21,6,23,6],[21,39,23,39],[21,40,23,40],[21,41,23,41],[21,43,23,43],[21,45,23,45],[21,46,23,46],[24,1,26,1],[24,2,26,2],[24,4,26,4],[24,5,26,5],[24,6,26,6],[24,39,26,39],[24,40,26,40],[24,41,26,41],[24,43,26,43],[24,45,26,45],[24,46,26,46],[27,1,29,1],[27,2,29,2],[27,4,29,4],[27,5,29,5],[27,6,29,6],[27,39,29,39],[27,40,29,40],[27,41,29,41],[27,43,29,43],[27,45,29,45],[27,46,29,46],[30,1,32,1],[30,2,32,2],[30,4,32,4],[30,5,32,5],[30,6,32,6],[30,39,32,39],[30,40,32,40],[30,41,32,41],[30,43,32,43],[30,45,32,45],[30,46,32,46],[33,1,35,1],[33,2,35,2],[33,4,35,4],[33,5,35,5],[33,6,35,6],[33,39,35,39],[33,40,35,40],[33,41,35,41],[33,43,35,43],[33,45,35,45],[33,46,35,46],[36,1,38,1],[36,2,38,2],[36,4,38,4],[36,5,38,5],[36,6,38,6],[36,39,38,39],[36,40,38,40],[36,41,38,41],[36,43,38,43],[36,45,38,45],[36,46,38,46],[39,1,41,1],[39,2,41,2],[39,4,41,4],[39,5,41,5],[39,6,41,6],[39,39,41,39],[39,40,41,40],[39,41,41,41],[39,43,41,43],[39,45,41,45],[39,46,41,46],[42,1,44,1],[42,2,44,2],[42,4,44,4],[42,5,44,5],[42,6,44,6],[42,39,44,39],[42,40,44,40],[42,41,44,41],[42,43,44,43],[42,45,44,45],[42,46,44,46],[45,1,47,1],[45,2,47,2],[45,4,47,4],[45,5,47,5],[45,6,47,6],[45,39,47,39],[45,40,47,40],[45,41,47,41],[45,43,47,43],[45,45,47,45],[45,46,47,46],[48,1,50,1],[48,2,50,2],[48,4,50,4],[48,5,50,5],[48,6,50,6],[48,39,50,39],[48,40,50,40],[48,41,50,41],[48,43,50,43],[48,45,50,45],[48,46,50,46],[51,1,53,1],[51,2,53,2],[51,4,53,4],[51,5,53,5],[51,6,53,6],[51,39,53,39],[51,40,53,40],[51,41,53,41],[51,43,53,43],[51,45,53,45],[51,46,53,46],[54,1,56,1],[54,2,56,2],[54,4,56,4],[54,5,56,5],[54,6,56,6],[54,39,56,39],[54,40,56,40],[54,41,56,41],[54,43,56,43],[54,45,56,45],[54,46,56,46],[57,1,59,1],[57,2,59,2],[57,4,59,4],[57,5,59,5],[57,6,59,6],[57,39,59,39],[57,40,59,40],[57,41,59,41],[57,43,59,43],[57,45,59,45],[57,46,59,46],[60,1,62,1],[60,2,62,2],[60,4,62,4],[60,5,62,5],[60,6,62,6],[60,39,62,39],[60,40,62,40],[60,41,62,41],[60,43,62,43],[60,45,62,45],[60,46,62,46],[63,1,65,1],[63,2,65,2],[63,4,65,4],[63,5,65,5],[63,6,65,6],[63,39,65,39],[63,40,65,40],[63,41,65,41],[63,43,65,43],[63,45,65,45],[63,46,65,46],[66,1,68,1],[66,2,68,2],[66,4,68,4],[66,5,68,5],[66,6,68,6],[66,39,68,39],[66,40,68,40],[66,41,68,41],[66,43,68,43],[66,45,68,45],[66,46,68,46],[69,1,71,1],[69,2,71,2],[69,4,71,4],[69,5,71,5],[69,6,71,6],[69,39,71,39],[69,40,71,40],[69,41,71,41],[69,43,71,43],[69,45,71,45],[69,46,71,46]]}
[1,{"$nulls":51},5]
[null,null,"Account Name:",{"$f":"'1-Tranche'!D2","v":"Trial Version"},{"$nulls":34},"TOP RISK REWARD RATIO",{"$nulls":4},"RISK",null,"REWARD","SETTINGS",{"$nulls":5},10,"Exact Value"]
[null,null,"Portfolio Size:",{"v":100000,"d":"100,000.00"},null,null,"           RRR","STOCK","POSITION SIZE",{"$nulls":29},"AVE. PRICE","STOP","TARGET","MARKET P.","LOSS","LOSS","GAIN","GAIN","1st Tranche","%LOSS","%GAIN",{"$nulls":3},100,"Board Lot"]
[null,null,"Position% Per Trade:",{"v":0.4,"d":"40.00%"},null,null,{"$f":"IFERROR(LARGE($AP$73:AP92,1),\"\")","v":{"v":3.0486829118153564,"d":"3.05"}},{"$f":"IF(G4=\"\",\"\",INDEX($C$73:C92,MATCH(G4,$AP$73:AP92,0)))","v":"IRC"},{"$f":"IF(G4=\"\",\"\",INDEX($I$73:I92,MATCH(G4,$AP$73:AP92,0)))","v":{"v":7000,"d":"7,000"}},{"$nulls":29},{"$f":"IF(G4=\"\",\"\",INDEX($D$73:D92,MATCH(G4,$AP$73:AP92,0)))","v":{"v":2.359020904761905,"d":"2.359"}},{"$f":"IF(G4=\"\",\"\",INDEX($E$73:E92,MATCH(G4,$AP$73:AP92,0)))","v":{"v":2.25,"d":"2.250"}},{"$f":"IF(G4=\"\",\"\",INDEX($F$73:F92,MATCH(G4,$AP$73:AP92,0)))","v":{"v":2.8,"d":"2.800"}},{"$f":"IF(G4=\"\",\"\",INDEX($G$73:G92,MATCH(G4,$AP$73:AP92,0)))","v":{"v":2.66,"d":"2.660"}},{"$f":"IF(G4=\"\",\"\",INDEX($AQ$73:AQ92,MATCH(G4,$AP$73:AP92,0)))","v":-939.3246666666696},{"$f":"IF(AQ4=\"\",\"\",TEXT(AQ4,\"0,00.00\")&\" (\"&TEXT(AV4,\"0.00%\")&\")\")","v":"-939.32 (-5.69%)"},{"$f":"IF(G4=\"\",\"\",INDEX($AS$73:AS92,MATCH(G4,$AP$73:AP92,0)))","v":2863.6936666666647},{"$f":"IF(AS4=\"\",\"\",TEXT(AS4,\"0,00.00\")&\" (\"&TEXT(AW4,\"0.00%\")&\")\")","v":"2,863.69 (17.34%)"},{"v":0.3,"d":"30%"},{"$f":"IF(G4=\"\",\"\",INDEX($AV$73:AV92,MATCH(G4,$AP$73:AP92,0)))","v":-0.056883445934864316},{"$f":"IF(G4=\"\",\"\",INDEX($AW$73:AW92,MATCH(G4,$AP$73:AP92,0)))","v":0.1734190207523342},{"$nulls":3},1000,"Risk Calculation",null,{"$f":"$D$5*AU4","v":12000},{"$f":"$D$7*AU4","v":300}]
[null,null,"Position Size Per Trade:",{"$f":"D3*D4","v":{"v":40000,"d":"40,000.00"}},null,null,{"$f":"IFERROR(LARGE($AP$73:AP93,2),\"\")","v":{"v":2.2134634978130983,"d":"2.21"}},{"$f":"IF(G5=\"\",\"\",INDEX($C$73:C93,MATCH(G5,$AP$73:AP93,0)))","v":"PXP"},{"$f":"IF(G5=\"\",\"\",INDEX($I$73:I93,MATCH(G5,$AP$73:AP93,0)))","v":{"v":1100,"d":"1,100"}},{"$nulls":29},{"$f":"IF(G5=\"\",\"\",INDEX($D$73:D93,MATCH(G5,$AP$73:AP93,0)))","v":{"v":17.163564090909095,"d":"17.164"}},{"$f":"IF(G5=\"\",\"\",INDEX($E$73:E93,MATCH(G5,$AP$73:AP93,0)))","v":{"v":16.42,"d":"16.420"}},{"$f":"IF(G5=\"\",\"\",INDEX($F$73:F93,MATCH(G5,$AP$73:AP93,0)))","v":{"v":19.4,"d":"19.400"}},{"$f":"IF(G5=\"\",\"\",INDEX($G$73:G93,MATCH(G5,$AP$73:AP93,0)))","v":{"v":16.3,"d":"16.300"}},{"$f":"IF(G5=\"\",\"\",INDEX($AQ$73:AQ93,MATCH(G5,$AP$73:AP93,0)))","v":-1008.7582999999995},{"$f":"IF(AQ5=\"\",\"\",TEXT(AQ5,\"0,00.00\")&\" (\"&TEXT(AV5,\"0.00%\")&\")\")","v":"-1,008.76 (-5.34%)"},{"$f":"IF(G5=\"\",\"\",INDEX($AS$73:AS93,MATCH(G5,$AP$73:AP93,0)))","v":2232.8294999999935},{"$f":"IF(AS5=\"\",\"\",TEXT(AS5,\"0,00.00\")&\" (\"&TEXT(AW5,\"0.00%\")&\")\")","v":"2,232.83 (11.83%)"},"2nd Tranche",{"$f":"IF(G5=\"\",\"\",INDEX($AV$73:AV93,MATCH(G5,$AP$73:AP93,0)))","v":-0.05343021968763054},{"$f":"IF(G5=\"\",\"\",INDEX($AW$73:AW93,MATCH(G5,$AP$73:AP93,0)))","v":0.11826477235431118},{"$nulls":3},10000,"Maximum Shares",null,{"$f":"$D$5*AU6","v":16000},{"$f":"$D$7*AU6","v":400}]
[null,null,"% to risk per trade:",{"v":0.025,"d":"2.50%"},null,null,{"$f":"IFERROR(LARGE($AP$73:AP94,3),\"\")","v":""},{"$f":"IF(G6=\"\",\"\",INDEX($C$73:C94,MATCH(G6,$AP$73:AP94,0)))","v":""},{"$f":"IF(G6=\"\",\"\",INDEX($I$73:I94,MATCH(G6,$AP$73:AP94,0)))","v":""},{"$nulls":29},{"$f":"IF(G6=\"\",\"\",INDEX($D$73:D94,MATCH(G6,$AP$73:AP94,0)))","v":""},{"$f":"IF(G6=\"\",\"\",INDEX($E$73:E94,MATCH(G6,$AP$73:AP94,0)))","v":""},{"$f":"IF(G6=\"\",\"\",INDEX($F$73:F94,MATCH(G6,$AP$73:AP94,0)))","v":""},{"$f":"IF(G6=\"\",\"\",INDEX($G$73:G94,MATCH(G6,$AP$73:AP94,0)))","v":""},{"$f":"IF(G6=\"\",\"\",INDEX($AQ$73:AQ94,MATCH(G6,$AP$73:AP94,0)))","v":""},"",{"$f":"IF(G6=\"\",\"\",INDEX($AS$73:AS94,MATCH(G6,$AP$73:AP94,0)))","v":""},"",{"v":0.4,"d":"40%"},{"$f":"IF(G6=\"\",\"\",INDEX($AV$73:AV94,MATCH(G6,$AP$73:AP94,0)))","v":""},{"$f":"IF(G6=\"\",\"\",INDEX($AW$73:AW94,MATCH(G6,$AP$73:AP94,0)))","v":""},{"$nulls":3},100000,"AVE. PRICE",null,{"$f":"$D$5*AU8","v":12000},{"$f":"$D$7*AU8","v":300}]
{"$rows_left_out":16}
{"sheet":"Expectancy","index":5,"n_rows":116,"n_cols":77,"rows_kept":116,"hidden":true,"merged":[[1,2,1,3],[1,6,1,7],[1,8,1,9],[1,10,1,13],[2,2,2,3],[2,6,2,7],[2,8,2,9],[3,2,3,3],[3,6,3,7],[3,8,3,9],[4,6,4,7],[4,8,4,9],[5,6,5,7],[5,8,5,9],[6,6,6,7],[6,8,6,9],[7,6,7,7],[7,8,7,9],[8,6,8,7],[8,8,8,9],[9,6,9,7],[9,8,9,9],[10,6,10,7],[10,8,10,9],[11,6,11,7],[11,8,11,9],[13,12,13,13],[20,1,21,1]]}
[]
[null,"Account Name:",{"$f":"REGNAME","v":"Trial Version"},{"$nulls":3},{"$f":"C6","v":"Strategy 1"},null,{"$f":"D6","v":"Strategy 2"},null,"EXPECTANCY CHART"]
[null,"Portfolio Size:",{"v":100000,"d":"100,000.00"},null,null,"#Win Trades:",{"$f":"T4 &\"/\"&C4","v":"25/100"},null,{"$f":"U4 &\"/\"&C4","v":"30/100"}]
[null,"# of Trades:",100,null,null,"#Loss Trades:",{"$f":"C4-T4&\"/\"&C4","v":"75/100"},null,{"$f":"C4-U4&\"/\"&C4","v":"70/100"},{"$nulls":10},{"$f":"COUNTIF($K$17:$K$116,$C$8)","v":25},{"$f":"COUNTIF($AH$17:$AH$116,$D$8)","v":30}]
[{"$nulls":5},"RRR:",{"$f":"IFERROR(\"1 : \"&TEXT((C8*C7)/(-C9*C7),\"#.00\"),0)","v":"1 : 3.20"},null,{"$f":"IFERROR(\"1 : \"&TEXT((D8*D7)/(-D9*D7),\"#.00\"),0)","v":"1 : 3.75"},{"$nulls":10},{"$f":"C4-T4","v":75},{"$f":"C4-U4","v":70},{"$nulls":3},{"$f":"H17","v":40000}]
[null,"Strategy:","Strategy 1","Strategy 2",null,"Average Port Gain/Trade:",{"$f":"(C8*C10)","v":{"v":0.08399999999999999,"d":"8.40%"}},null,{"$f":"(D8*D10)","v":{"v":0.06,"d":"6.00%"}}]
{"$rows_left_out":111}
{"sheet":"RBAF","index":6,"n_rows":30,"n_cols":21,"rows_kept":30,"hidden":true,"merged":[[3,9,3,12],[16,9,16,12],[19,1,20,5]]}
[]
[null,null,"RESULT-BASED ASSUMPTION FORECAST"]
[]
[null,"Account Name:",{"$f":"Expectancy!C2","v":"Trial Version"},{"$nulls":6},"REQUIRED WIN RATE% VS  RRR",{"$nulls":5},{"$f":"P5","v":3.2},{"$f":"1/(1+($P$5/2))","v":0.3846153846153846}]
[null,"Portfolio Size:",{"v":100000,"d":"100,000.00"},null,{"$f":"IFERROR(IF(U17<0,\"# of Trades to Loss \"&TEXT(F18,\"0.0%\")&\":\",\"# of Trades to Gain \"&TEXT(F18,\"0.0%\")&\":\"),\"\")","v":"# of Trades to Gain 52.2%:"},{"$f":"IFERROR(IF(RBAF!U17<0,(RBAF!U16+RBAF!U18)&\" trades\",RBAF!U17&\" trades\"),0)","v":"51 trades"},{"$nulls":9},{"$f":"C7/-C8","v":3.2},{"$f":"1/(1+($P$5/1))","v":0.23809523809523808}]
[null,"Win Rate%:",{"v":0.25,"d":"25.00%"},null,"#Win Trades:",{"$f":"IFERROR(IF(RBAF!$U$17<0,RBAF!U16,ROUND((RBAF!U17)*RBAF!C6,0)),0)","v":13},{"$nulls":4},{"v":3,"d":"3.00"},"Risk Reward Ratio:",{"$f":"IFERROR(\"1 : \"&TEXT((C7/-C8),\"#0.00\"),0)","v":"1 : 3.20"},{"$nulls":3},"winrate"]
{"$rows_left_out":25}
{"sheet":"Trade Plan","index":7,"n_rows":16,"n_cols":47,"rows_kept":16,"hidden":true,"merged":[[2,6,2,8],[3,3,4,5],[3,6,4,8],[3,17,3,18],[3,20,3,24],[4,17,4,18],[4,20,4,21],[4,23,4,24],[5,17,5,18],[5,20,5,21],[5,23,5,24],[6,7,6,8],[6,17,6,18],[6,20,6,21],[6,23,6,24],[7,7,7,8],[7,17,7,18],[7,20,7,21],[7,23,7,24],[8,17,8,18],[8,20,8,21],[8,23,8,24],[9,6,9,8],[9,17,9,18],[9,20,9,21],[9,23,9,24],[11,4,11,7],[11,8,11,9],[11,10,11,11],[11,16,11,18],[11,20,11,21],[11,23,11,24],[12,2,13,2],[12,3,13,3],[12,4,13,4],[12,5,13,5],[12,6,13,6],[12,7,13,7],[12,8,13,8],[12,9,13,9],[12,16,12,18],[12,20,13,21],[12,23,13,24]]}
[{"$nulls":26},5058451]
[]
[{"$nulls":5},"Account Name:",{"$f":"'1-Tranche'!D2","v":"Trial Version"}]
[{"$nulls":3},"Account Equity Value:",null,null,{"v":100000,"d":"100,000.00"},{"$nulls":10},"PORTFOLIO",null,null,"PORTFOLIO FORECAST",{"$nulls":5},{"$f":"I12","v":"SL & TP in Price"},{"$nulls":6},"BROKER FEE SETTINGS"]
[{"$nulls":17},"MARKET VALUE",null,null,{"$f":"U13","v":"Target Price"},null,null,{"$f":"X13","v":"Stop-loss \nor Trail Stop"},null,null,{"$f":"K12","v":"SL & TP in %"},{"$nulls":6},"Fees","From","Multiply by","Minimum","From","Maximum"]
[{"$nulls":16},"Total Bought Value:",{"$f":"IF(SUM(N15:N29)=0,\"No Stock Position\",SUM(N15:N29))","v":{"v":70852,"d":"$70,852.00"}},null,null,{"$f":"R6","v":{"v":70852,"d":"$70,852.00"}},null,null,{"$f":"R6","v":{"v":70852,"d":"$70,852.00"}},{"$nulls":9},{"$f":"'User Guide & Settings'!O5","v":"Commission"},{"$f":"'User Guide & Settings'!P5","v":"Amount"},{"$f":"'User Guide & Settings'!Q5","v":0.0025},{"$f":"'User Guide & Settings'!R5","v":20},{"$f":"'User Guide & Settings'!S5","v":"Amount"},{"$f":"'User Guide & Settings'!T5","v":0}]
{"$rows_left_out":11}
{"sheet":"User Guide & Settings","index":8,"n_rows":144,"n_cols":29,"rows_kept":144,"hidden":true,"merged":[[1,1,1,19],[2,14,2,19],[3,3,5,11],[9,2,9,19],[13,2,15,6],[24,2,26,6],[38,2,45,6],[56,2,56,4],[57,2,57,4],[58,2,58,4],[59,2,59,4],[65,2,67,7],[70,2,70,7],[75,2,76,6],[78,2,82,6],[87,2,90,6],[92,2,97,6],[103,2,106,6],[115,13,115,19],[117,2,119,8],[121,2,124,8],[125,10,125,18]]}
[]
[null,"USER GUIDE AND SETTINGS"]
[{"$nulls":3},"Risk management Spreadsheet (RMS)\n",{"$nulls":10},"BROKER FEE SETTINGS",{"$nulls":10},"From","To"]
[{"$nulls":3},"AA Excel Spreadsheets© 2016. All Rights Reserved.",{"$nulls":10},"Fees","From","Multiply by","Minimum","From","Maximum",null,null,"Trade",null,null,1E-4,0.0099,1E-4,{"v":1000000,"d":"1,000,000"}]
[{"$nulls":14},"Commission","Amount",{"v":0.0025,"d":"0.00250"},{"v":20,"d":"20.0"},"Amount",{"$nulls":3},"Amount",null,null,0.01,0.049,1E-3,{"v":100000,"d":"100,000"}]
[{"$nulls":14},"VAT","Amount",{"v":0.0003,"d":"0.00030"},2.4,"Amount",{"$nulls":3},"Total Shares",null,null,0.05,0.249,1E-3,{"v":10000,"d":"10,000"}]
{"$rows_left_out":91}
{"sheet":"Sheet1","index":9,"n_rows":305,"n_cols":13,"rows_kept":305,"hidden":true}
["Date","symbol","Name","Currency","Closing","% change","Volume","Value"]
["2018-10-23T14:50:00+08:00","2GO","2GO Group","PHP",11.5,-1.71,16900,null,null,1E-4,1,{"$f":"IFERROR(Table1[[#This Row],[% change]]+J2,\"\")","v":-1.7099},{"$f":"IFERROR(Table1[[#This Row],[Volume]]*Table1[[#This Row],[Closing]]+J2,\"\")","v":194350.0001}]
["2018-10-23T14:50:00+08:00","8990P","HOUSE PREF A","PHP",99,3.07,1300,null,null,0.0002,2,{"$f":"IFERROR(Table1[[#This Row],[% change]]+J3,\"\")","v":3.0702},{"$f":"IFERROR(Table1[[#This Row],[Volume]]*Table1[[#This Row],[Closing]]+J3,\"\")","v":128700.0002}]
["2018-10-23T14:50:00+08:00","AB","Atok A","PHP",17.4,-0.46,5700,null,null,0.0003,3,{"$f":"IFERROR(Table1[[#This Row],[% change]]+J4,\"\")","v":-0.4597},{"$f":"IFERROR(Table1[[#This Row],[Volume]]*Table1[[#This Row],[Closing]]+J4,\"\")","v":99180.00029999999}]
["2018-10-23T14:50:00+08:00","ABA","ABACORE CAPITAL","PHP",0.465,1.09,28010000,null,null,0.0004,4,{"$f":"IFERROR(Table1[[#This Row],[% change]]+J5,\"\")","v":1.0904},{"$f":"IFERROR(Table1[[#This Row],[Volume]]*Table1[[#This Row],[Closing]]+J5,\"\")","v":13024650.0004}]
["2018-10-23T14:50:00+08:00","ABG","Asiabest Gorup","PHP",26,-1.14,15500,null,null,0.0005,5,{"$f":"IFERROR(Table1[[#This Row],[% change]]+J6,\"\")","v":-1.1395},{"$f":"IFERROR(Table1[[#This Row],[Volume]]*Table1[[#This Row],[Closing]]+J6,\"\")","v":403000.0005}]
{"$rows_left_out":299}