{"text_format":"3","workbook":"xlsx","n_sheets":9,"sheets":["Form","HOME","Bank Transfers","DASHBOARD","TRADE LOG","TRADE STATISTICS","MONTHLY REPORT","CALENDAR","SETTINGS"],"not_rendered":{"charts":17,"images":39,"macros":1,"defined_names":36,"pivot_tables":2},"read":"whole","date_system":"1900"}

{"sheet":"Form","index":0,"n_rows":18,"n_cols":10,"rows_kept":18,"hidden":true}
[]
[]
[{"$nulls":6},{"$f":"IF(J18=0,\"ACTIVATION FORM\",IF(J18=2,\"EMERGENCY ACCESS FORM\",\"RE-ACTIVATION FORM\"))","v":"ACTIVATION FORM"}]
[{"$nulls":6},"Enter your prefer Name (This will be displayed in the file interface)"]
[]
[{"$nulls":6},"Paste the Activation Code below to proceed:"]
{"$rows_empty":11}
[{"$nulls":9},0]

{"sheet":"HOME","index":1,"n_rows":40,"n_cols":24,"rows_kept":40,"merged":[[11,3,11,17]]}
[]
[{"$nulls":10},"Forex Trading Journal "]
[{"$nulls":10},"Professional Journaling Solution",{"$nulls":7},"V.1.0"]
[{"$nulls":18},{"$f":"\"Registered to \"&Nameko","v":"Registered to Rocketsheets"}]
[]
[]
[]
[]
[]
[{"$nulls":23},1]
[]
[{"$nulls":3},{"$f":"'Bank Transfers'!W10","v":"Welcome!"}]
[{"$nulls":10},{"$f":"'Bank Transfers'!W11","v":"Successfully Registered to Rocketsheets."}]
[]
[{"$nulls":3},"If sheets did'nt appear, macro is disabled. Follow steps below.",{"$nulls":9},"System Requirements: MS Excel"]
[{"$nulls":13},"Recommended: At least Excel 2010"]
[{"$nulls":3},"How to Enable Macro:",{"$nulls":3},"Scroll Down for Tutorial",{"$nulls":5},"Excel 365 autosave should be turned-off"]
[{"$nulls":13},"Its recommended to save the file in folder that are not linked to Onedrive."]
[]
[{"$nulls":3},"Click Enable Content."]
[{"$nulls":3},"if Security Warning above doesn't appear, follow tutorial below."]
[{"$nulls":13},"How to view the Developer Tab:"]
[{"$nulls":3},"Step 1a: ","Go to Developer Tab and Click Macro Security (image#1)"]
[{"$nulls":4},"(if Developer Tab doesn't apper go to Step 1b.)",{"$nulls":8},"Step 1b:","Press ALT and type FTC (for MS 2016) or go to File tab"]
[{"$nulls":3},"   image#1",{"$nulls":10},"go to Options>Customize Ribbon"]
[{"$nulls":13},"Step 2b:   ","Check the Developer and the Click OK button"]
[]
[{"$nulls":13},"image#3"]
[]
[]
[]
[{"$nulls":3},"Step 2a: ","Select 3rd or 4th option (Enable all macros) and click OK (image#2)",{"$nulls":8},"Step 3b:","Follow Step1a , Step2a and Step 3a. (image#3)"]
[{"$nulls":3},"   image#2"]
[]
[{"$nulls":13},"Contact Us at:"]
[{"$nulls":13},"info@rocketsheets.com"]
[{"$nulls":13},"aaespreadsheets@gmail.com"]
[]
[{"$nulls":13},"Website:"]
[{"$nulls":3},"Step 3a: ","Save changes and Re- OPEN this worksheet.",{"$nulls":8},"rocketsheets.com"]

{"sheet":"Bank Transfers","index":2,"n_rows":114,"n_cols":42,"rows_kept":114,"hidden":true}
[1,{"$nulls":21},"b1sm1ll4h","b1sm1ll4h","R4ALEEARUDAB4AARMN4LH008ER",{"$f":"CLEAN(Y1)","v":"R4ALEEARUDAB4AARMN4LH008ER"}]
[{"$nulls":22},"rocketsheets.com",null,null,{"$f":"IFERROR(IF(Z1=\"\",W3-2,IF(AE6=\"HR\",AO7,W3-2)),W3-2)","v":"2023-03-13"},{"$nulls":14},"excel date format verification"]
[{"$nulls":22},"2023-03-15",null,null,{"$f":"IF(AA3=\"\",\"Rocketsheets\",AA3)","v":"0"},{"$f":"PROPER(TRIM(CONCATENATE(AJ15,AJ16,AJ17,AJ18,AJ19,AJ20,AJ21,AJ22,AJ23,AJ24,AJ25,AJ26,AJ27,AJ28,AJ29,AJ30,AJ31,AJ32,AJ33,AJ34,AJ35,AJ36,AJ37,AJ38,AJ39,AJ40,AJ41,AJ42,AJ43,AJ44,AJ45,AJ46,AJ47,AJ48,AJ49,AJ50,AJ51,AJ52,AJ53,AJ54)))","v":"0"},null,null,"name",{"$f":"AB7","v":"RI"},{"$f":"LEN(AE3)","v":2},{"$nulls":8},0]
[{"$nulls":7},"TOTAL DEPOSITS","TOTAL WITHDRAWALS",null,null,"BUY",{"$nulls":10},"2023-03-13",{"$nulls":17},{"$f":"VALUE($AN$15&$AN$16&\"/\"&$AN$17&$AN$18&\"/\"&$AN$19&$AN$20)","v":45241},"MDY"]
[{"$nulls":7},{"$f":"SUMIF(E15:E1048576,\"Deposit\",$H$15:$H$514)","v":50000},{"$f":"SUMIF(E15:E1048576,\"Withdraw\",$H$15:$H$514)","v":0},{"$f":"I5+H5","v":50000},null,"SELL",{"$nulls":17},"date",{"$f":"aCode","v":0},{"$nulls":9},{"$f":"VALUE($AN$17&$AN$18&\"/\"&$AN$15&$AN$16&\"/\"&$AN$19&$AN$20)","v":45241},"DMY"]
[{"$nulls":22},1,null,"Inputs",{"$nulls":4},"ID",{"$f":"AG9&AH9","v":"00"},{"$nulls":9},{"$f":"VALUE(AN19&AN20&\"/\"&AN15&AN16&\"/\"&AN17&AN18)","v":{"$error":"#VALUE!"}},"YMD"]
[{"$nulls":7},"Capital + Profit","Withdrawal","Net Total",null,"Deposit",{"$nulls":10},2,null,"Name",{"$f":"Form!G5","v":0},{"$f":"LEN(Z7)","v":1},{"$f":"TRIM(Z16&Z17&Z18&Z19&Z20&Z21&Z22&Z23&Z24&Z25&Z26&Z27&Z28&Z29&Z30&Z31&Z32&Z33&Z34&Z35&Z36&Z37&Z38&Z39&Z40&Z41&Z42&Z43&Z44&Z45&Z46&Z47&Z48&Z49&Z50&Z51&Z52&Z53&Z54&Z55)","v":"RI"},{"$nulls":12},{"$f":"IF(AO3=0,AO4,IF(AO3=1,AO5,AO6))","v":45241}]
[{"$nulls":5},"Capital:",null,{"$f":"H5","v":50000},{"$f":"IF(-I5>H8,H8,-I5)","v":0},{"$f":"H8-I8","v":50000},null,"Withdraw",{"$nulls":10},"BSMLH-0107"]
[{"$nulls":5},"Total Profit/Loss:",null,{"$f":"'TRADE STATISTICS'!AO9+'MONTHLY REPORT'!M14","v":4271.4200000000055},{"$f":"-(IF(-I5>H8,(I5+H8),0))","v":0},{"$f":"H9-I9","v":4271.4200000000055},{"$nulls":14},{"$f":"AB7&AE5","v":"RI0"},null,null,{"$f":"RIGHT(LEFT(AE5,2),1)","v":"0"},{"$f":"RIGHT(LEFT(AE5,5),1)","v":"0"},{"$f":"INDEX($AF$15:$AF$54,MATCH($AB$9,$AC$15:$AC$54,0))","v":"1"},{"$f":"INDEX($AF$15:$AF$54,MATCH($AC$9,$AC$15:$AC$54,0))","v":"1"},null,{"$f":"LEFT(AE5,1)","v":"0"},{"$f":"RIGHT(AE5,1)","v":"0"}]
[{"$nulls":5},"End Capital:",null,{"$f":"H8+H9","v":54271.420000000006},{"$f":"I9+I8","v":0},{"$f":"J9+J8","v":54271.420000000006},{"$nulls":12},{"$f":"IF(W6=\"\",\"Please Enable Macro\",IF(W6=1,IF(AND(W6=1,OR(W7=\"\",W7=1)),\"Registration Error!\",\"Welcome!\"),\"Welcome!\"))","v":"Welcome!"},{"$nulls":3},{"$f":"YEAR(TODAY())","v":2023},{"$f":"RIGHT(LEFT(AE5,4),1)","v":"0"},{"$f":"RIGHT(LEFT(AE5,3),1)","v":"0"},{"$f":"INDEX($AF$15:$AF$54,MATCH($AB$10,$AC$15:$AC$54,0))","v":"1"},{"$f":"INDEX($AF$15:$AF$54,MATCH($AC$10,$AC$15:$AC$54,0))","v":"1"},null,{"$f":"INDEX($AF$15:$AF$54,MATCH($AG$9,$AC$15:$AC$54,0))","v":"1"},{"$f":"INDEX($AF$15:$AF$54,MATCH($AH$9,$AC$15:$AC$54,0))","v":"1"}]
[{"$nulls":22},{"$f":"IF(W10=\"registration error!\",\"Registered to \"&Nameko&\". Please contact AAES if you received this error.\",IF(W10=\"Please Enable Macro\",\"All sheet calculations are based on macro, scroll down for tutorial.\",\"Successfully \"&HOME!S4&\".\"))","v":"Successfully Registered to Rocketsheets."},".",null,null,{"$f":"RIGHT(AA10,2)","v":"23"},{"$f":"LEFT(AA11,1)","v":"2"},{"$f":"RIGHT(AA11,1)","v":"3"},{"$f":"AB11","v":"2"},{"$f":"AC11","v":"3"}]
[]
[{"$nulls":3},"▼ BROKER ACCOUNT DEPOSITS/WITHDRAWALS"]
[null,null,"No.","Date","Action","Gross Amount",null,"Net Amount","Notes",{"$nulls":5},{"$f":"COUNTIF('TRADE LOG'!$C$14:$C$733,\">\"&'Bank Transfers'!D15)","v":56},{"$nulls":13},"CODE2",null,null,"text","code name",null,"reader",{"$nulls":4},"date"]
[null,null,1,{"$f":"IFERROR(INDEX(Datelog,SMALL('TRADE LOG'!$AD$15:$AD$9733,C15)),\"\")","v":43977.24188657408},{"$f":"IF(F15=\"\",\"\",IF(F15>0,\"Deposit\",\"Withdraw\"))","v":"Deposit"},{"$f":"IFERROR(INDEX('TRADE LOG'!$T$15:$T$733,SMALL('TRADE LOG'!$AD$15:$AD$733,C15)),\"\")","v":50000},null,{"$f":"F15","v":50000},"Beginning Balance",null,null,{"$f":"IFERROR(DATE(YEAR(D15),MONTH(D15),DAY(1)),\"\")","v":43952},{"$f":"SETTINGS!AH2","v":45002},null,{"$f":"COUNTIFS('TRADE LOG'!$C$14:$C$733,\"<\"&'Bank Transfers'!D15,'TRADE LOG'!$C$14:$C$733,\">=\"&'Bank Transfers'!D14)","v":0},{"$f":"O15","v":0},{"$nulls":8},"Name","namecode",null,null,"1","AR",null,"A",{"$f":"AD15","v":"AR"},2,{"$f":"IF(AH15>$AF$3,\"\",RIGHT(LEFT($AE$3,AH15),2))","v":"RI"},{"$f":"IFERROR(INDEX($AF$15:$AF$56,MATCH(AI15,$AG$15:$AG$56,0)),\"\")","v":"0"},{"$nulls":3},{"$f":"AD9","v":"1"}]
[null,null,{"$f":"C15+1","v":2},{"$f":"IF(J16=0,\"\",J16)","v":""},"",{"$f":"IF(J16=0,\"\",IFERROR(INDEX('TRADE LOG'!$T$15:$T$733,SMALL('TRADE LOG'!$AD$15:$AD$733,C16)),\"\"))","v":""},null,{"$f":"F16","v":""},null,{"$f":"IFERROR(INDEX(Datelog,SMALL('TRADE LOG'!$AD$15:$AD$9733,C16)),\"\")","v":""},null,{"$f":"DATE(YEAR(D16),MONTH(D16),DAY(1))","v":{"$error":"#VALUE!"}},{"$f":"DATE(YEAR(M15),MONTH(M15),DAY(1))","v":44986},null,{"$f":"COUNTIFS('TRADE LOG'!$C$14:$C$733,\"<\"&'Bank Transfers'!D16,'TRADE LOG'!$C$14:$C$733,\">=\"&'Bank Transfers'!D15)","v":0},{"$f":"O16","v":0},{"$nulls":7},1,{"$f":"IF(X16>$AA$7,\"\",RIGHT(LEFT($Z$7,X16),1))","v":"0"},{"$f":"IFERROR(INDEX($AG$15:$AG$56,MATCH(Y16,$AF$15:$AF$56,)),\"\")","v":"RI"},null,null,"F","R4",null,"B","R4",4,{"$f":"IF(AH16>$AF$3,\"\",RIGHT(LEFT($AE$3,AH16),2))","v":""},{"$f":"IFERROR(INDEX($AF$15:$AF$56,MATCH(AI16,$AG$15:$AG$56,0)),\"\")","v":""},{"$nulls":3},{"$f":"AE9","v":"1"}]
[null,null,{"$f":"C16+1","v":3},{"$f":"IFERROR(INDEX(Datelog,SMALL('TRADE LOG'!$AD$15:$AD$9733,C17)),\"\")","v":""},"",{"$f":"IFERROR(INDEX('TRADE LOG'!$T$15:$T$733,SMALL('TRADE LOG'!$AD$15:$AD$733,C17)),\"\")","v":""},null,"",{"$nulls":3},{"$f":"DATE(YEAR(D17),MONTH(D17),DAY(1))","v":{"$error":"#VALUE!"}},{"$f":"SUMIFS(H15:H514,L15:L514,M16,E15:E514,\"deposit\")","v":0},{"$f":"IF(COUNT('MONTHLY REPORT'!$X$15)=0,IF(M16=SETTINGS!#REF!,SETTINGS!S86+'Bank Transfers'!M17,'Bank Transfers'!M17))","v":false},{"$f":"COUNTIFS('TRADE LOG'!$C$14:$C$733,\"<\"&'Bank Transfers'!D17,'TRADE LOG'!$C$14:$C$733,\">=\"&'Bank Transfers'!D16)","v":0},{"$f":"O17+P16","v":0},{"$nulls":7},2,{"$f":"IF(X17>$AA$7,\"\",RIGHT(LEFT($Z$7,X17),1))","v":""},"",null,null,"3","HM",null,"C","HM",6,"","",{"$nulls":3},{"$f":"AD10","v":"1"}]
[null,null,4,{"$f":"IFERROR(INDEX(Datelog,SMALL('TRADE LOG'!$AD$15:$AD$9733,C18)),\"\")","v":""},"",{"$f":"IFERROR(INDEX('TRADE LOG'!$T$15:$T$733,SMALL('TRADE LOG'!$AD$15:$AD$733,C18)),\"\")","v":""},null,"",{"$nulls":3},{"$error":"#VALUE!"},{"$f":"SUMIFS(H15:H514,L15:L514,M16,E15:E514,\"withdraw\")","v":0},{"$f":"IF(COUNT('MONTHLY REPORT'!$X$15)=0,IF(M16=SETTINGS!#REF!,SETTINGS!S87+'Bank Transfers'!M18,'Bank Transfers'!M18))","v":false},{"$f":"COUNTIFS('TRADE LOG'!$C$14:$C$733,\"<\"&'Bank Transfers'!D18,'TRADE LOG'!$C$14:$C$733,\">=\"&'Bank Transfers'!D17)","v":0},{"$f":"O18+P17","v":0},{"$nulls":7},3,"","",null,null,"G","4A",null,"D","4A",8,"","",{"$nulls":3},{"$f":"AE10","v":"1"}]
[null,null,5,{"$f":"IFERROR(INDEX(Datelog,SMALL('TRADE LOG'!$AD$15:$AD$9733,C19)),\"\")","v":""},"",{"$f":"IFERROR(INDEX('TRADE LOG'!$T$15:$T$733,SMALL('TRADE LOG'!$AD$15:$AD$733,C19)),\"\")","v":""},null,"",{"$nulls":3},{"$error":"#VALUE!"},null,null,{"$f":"COUNTIFS('TRADE LOG'!$C$14:$C$733,\"<\"&'Bank Transfers'!D19,'TRADE LOG'!$C$14:$C$733,\">=\"&'Bank Transfers'!D18)","v":0},{"$f":"O19+P18","v":0},{"$nulls":7},4,"","",null,null,"5","N4",null,"E","N4",10,"","",{"$nulls":3},{"$f":"AD11","v":"2"}]
[null,null,6,{"$f":"IFERROR(INDEX(Datelog,SMALL('TRADE LOG'!$AD$15:$AD$9733,C20)),\"\")","v":""},"",{"$f":"IFERROR(INDEX('TRADE LOG'!$T$15:$T$733,SMALL('TRADE LOG'!$AD$15:$AD$733,C20)),\"\")","v":""},null,"",{"$nulls":3},{"$error":"#VALUE!"},null,null,{"$f":"COUNTIFS('TRADE LOG'!$C$14:$C$733,\"<\"&'Bank Transfers'!D20,'TRADE LOG'!$C$14:$C$733,\">=\"&'Bank Transfers'!D19)","v":0},{"$f":"O20+P19","v":0},{"$nulls":7},5,"","",null,null,"H","RR",null,"F","RR",12,"","",{"$nulls":3},{"$f":"AE11","v":"3"}]
[null,null,7,{"$f":"IFERROR(INDEX(Datelog,SMALL('TRADE LOG'!$AD$15:$AD$9733,C21)),\"\")","v":""},"",{"$f":"IFERROR(INDEX('TRADE LOG'!$T$15:$T$733,SMALL('TRADE LOG'!$AD$15:$AD$733,C21)),\"\")","v":""},null,"",{"$nulls":3},{"$error":"#VALUE!"},null,null,{"$f":"COUNTIFS('TRADE LOG'!$C$14:$C$733,\"<\"&'Bank Transfers'!D21,'TRADE LOG'!$C$14:$C$733,\">=\"&'Bank Transfers'!D20)","v":0},0,{"$nulls":7},6,"","",null,null,"7","H3",null,"G","H3",14,"",""]
[null,null,8,{"$f":"IFERROR(INDEX(Datelog,SMALL('TRADE LOG'!$AD$15:$AD$9733,C22)),\"\")","v":""},"",{"$f":"IFERROR(INDEX('TRADE LOG'!$T$15:$T$733,SMALL('TRADE LOG'!$AD$15:$AD$733,C22)),\"\")","v":""},null,"",{"$nulls":3},{"$error":"#VALUE!"},null,null,{"$f":"COUNTIFS('TRADE LOG'!$C$14:$C$733,\"<\"&'Bank Transfers'!D22,'TRADE LOG'!$C$14:$C$733,\">=\"&'Bank Transfers'!D21)","v":0},0,{"$nulls":7},7,"","",null,null,"I","3M",null,"H","3M",16,"",""]
[null,null,9,{"$f":"IFERROR(INDEX(Datelog,SMALL('TRADE LOG'!$AD$15:$AD$9733,C23)),\"\")","v":""},"",{"$f":"IFERROR(INDEX('TRADE LOG'!$T$15:$T$733,SMALL('TRADE LOG'!$AD$15:$AD$733,C23)),\"\")","v":""},null,"",{"$nulls":3},{"$error":"#VALUE!"},null,null,{"$f":"COUNTIFS('TRADE LOG'!$C$14:$C$733,\"<\"&'Bank Transfers'!D23,'TRADE LOG'!$C$14:$C$733,\">=\"&'Bank Transfers'!D22)","v":0},0,{"$nulls":7},8,"","",null,null,"9","4L",null,"I","4L",18,"",""]
[null,null,10,{"$f":"IFERROR(INDEX(Datelog,SMALL('TRADE LOG'!$AD$15:$AD$9733,C24)),\"\")","v":""},"",{"$f":"IFERROR(INDEX('TRADE LOG'!$T$15:$T$733,SMALL('TRADE LOG'!$AD$15:$AD$733,C24)),\"\")","v":""},null,"",{"$nulls":3},{"$error":"#VALUE!"},null,null,{"$f":"COUNTIFS('TRADE LOG'!$C$14:$C$733,\"<\"&'Bank Transfers'!D24,'TRADE LOG'!$C$14:$C$733,\">=\"&'Bank Transfers'!D23)","v":0},0,{"$nulls":7},9,"","",null,null,"O","M4",null,"J","M4",20,"",""]
[null,null,11,{"$f":"IFERROR(INDEX(Datelog,SMALL('TRADE LOG'!$AD$15:$AD$9733,C25)),\"\")","v":""},"",{"$f":"IFERROR(INDEX('TRADE LOG'!$T$15:$T$733,SMALL('TRADE LOG'!$AD$15:$AD$733,C25)),\"\")","v":""},null,"",{"$nulls":3},{"$error":"#VALUE!"},null,null,{"$f":"COUNTIFS('TRADE LOG'!$C$14:$C$733,\"<\"&'Bank Transfers'!D25,'TRADE LOG'!$C$14:$C$733,\">=\"&'Bank Transfers'!D24)","v":0},0,{"$nulls":7},10,"","",null,null,"J","L1",null,"K","L1",22,"",""]
[null,null,12,{"$f":"IFERROR(INDEX(Datelog,SMALL('TRADE LOG'!$AD$15:$AD$9733,C26)),\"\")","v":""},"",{"$f":"IFERROR(INDEX('TRADE LOG'!$T$15:$T$733,SMALL('TRADE LOG'!$AD$15:$AD$733,C26)),\"\")","v":""},null,"",{"$nulls":3},{"$error":"#VALUE!"},null,null,{"$f":"COUNTIFS('TRADE LOG'!$C$14:$C$733,\"<\"&'Bank Transfers'!D26,'TRADE LOG'!$C$14:$C$733,\">=\"&'Bank Transfers'!D25)","v":0},0,{"$nulls":7},11,"","",null,null,"N","K4",null,"L","K4",24,"",""]
[null,null,13,{"$f":"IFERROR(INDEX(Datelog,SMALL('TRADE LOG'!$AD$15:$AD$9733,C27)),\"\")","v":""},"",{"$f":"IFERROR(INDEX('TRADE LOG'!$T$15:$T$733,SMALL('TRADE LOG'!$AD$15:$AD$733,C27)),\"\")","v":""},null,"",{"$nulls":3},{"$error":"#VALUE!"},null,null,{"$f":"COUNTIFS('TRADE LOG'!$C$14:$C$733,\"<\"&'Bank Transfers'!D27,'TRADE LOG'!$C$14:$C$733,\">=\"&'Bank Transfers'!D26)","v":0},0,{"$nulls":7},12,"","",null,null,"K","LQ",null,"M","LQ",26,"",""]
[null,null,14,{"$f":"IFERROR(INDEX(Datelog,SMALL('TRADE LOG'!$AD$15:$AD$9733,C28)),\"\")","v":""},"",{"$f":"IFERROR(INDEX('TRADE LOG'!$T$15:$T$733,SMALL('TRADE LOG'!$AD$15:$AD$733,C28)),\"\")","v":""},null,"",{"$nulls":3},{"$error":"#VALUE!"},null,null,{"$f":"COUNTIFS('TRADE LOG'!$C$14:$C$733,\"<\"&'Bank Transfers'!D28,'TRADE LOG'!$C$14:$C$733,\">=\"&'Bank Transfers'!D27)","v":0},0,{"$nulls":7},13,"","",null,null,"M","UD",null,"N","UD",28,"",""]
[null,null,15,{"$f":"IFERROR(INDEX(Datelog,SMALL('TRADE LOG'!$AD$15:$AD$9733,C29)),\"\")","v":""},"",{"$f":"IFERROR(INDEX('TRADE LOG'!$T$15:$T$733,SMALL('TRADE LOG'!$AD$15:$AD$733,C29)),\"\")","v":""},null,"",{"$nulls":3},{"$error":"#VALUE!"},null,null,{"$f":"COUNTIFS('TRADE LOG'!$C$14:$C$733,\"<\"&'Bank Transfers'!D29,'TRADE LOG'!$C$14:$C$733,\">=\"&'Bank Transfers'!D28)","v":0},0,{"$nulls":7},14,"","",null,null,"L","DU",null,"O","DU",30,"",""]
[null,null,16,{"$f":"IFERROR(INDEX(Datelog,SMALL('TRADE LOG'!$AD$15:$AD$9733,C30)),\"\")","v":""},"",{"$f":"IFERROR(INDEX('TRADE LOG'!$T$15:$T$733,SMALL('TRADE LOG'!$AD$15:$AD$733,C30)),\"\")","v":""},null,"",{"$nulls":3},{"$error":"#VALUE!"},null,null,{"$f":"COUNTIFS('TRADE LOG'!$C$14:$C$733,\"<\"&'Bank Transfers'!D30,'TRADE LOG'!$C$14:$C$733,\">=\"&'Bank Transfers'!D29)","v":0},0,{"$nulls":7},15,"","",null,null,"T","SA",null,"P","SA",32,"",""]
[null,null,17,{"$f":"IFERROR(INDEX(Datelog,SMALL('TRADE LOG'!$AD$15:$AD$9733,C31)),\"\")","v":""},"",{"$f":"IFERROR(INDEX('TRADE LOG'!$T$15:$T$733,SMALL('TRADE LOG'!$AD$15:$AD$733,C31)),\"\")","v":""},null,"",{"$nulls":3},{"$error":"#VALUE!"},null,null,{"$f":"COUNTIFS('TRADE LOG'!$C$14:$C$733,\"<\"&'Bank Transfers'!D31,'TRADE LOG'!$C$14:$C$733,\">=\"&'Bank Transfers'!D30)","v":0},0,{"$nulls":7},16,"","",null,null,"U","SS",null,"Q","SS",34,"",""]
[null,null,18,{"$f":"IFERROR(INDEX(Datelog,SMALL('TRADE LOG'!$AD$15:$AD$9733,C32)),\"\")","v":""},"",{"$f":"IFERROR(INDEX('TRADE LOG'!$T$15:$T$733,SMALL('TRADE LOG'!$AD$15:$AD$733,C32)),\"\")","v":""},null,"",{"$nulls":3},{"$error":"#VALUE!"},null,null,{"$f":"COUNTIFS('TRADE LOG'!$C$14:$C$733,\"<\"&'Bank Transfers'!D32,'TRADE LOG'!$C$14:$C$733,\">=\"&'Bank Transfers'!D31)","v":0},0,{"$nulls":7},17,"","",null,null,"V","AL",null,"R","AL",36,"",""]
[null,null,19,{"$f":"IFERROR(INDEX(Datelog,SMALL('TRADE LOG'!$AD$15:$AD$9733,C33)),\"\")","v":""},"",{"$f":"IFERROR(INDEX('TRADE LOG'!$T$15:$T$733,SMALL('TRADE LOG'!$AD$15:$AD$733,C33)),\"\")","v":""},null,"",{"$nulls":3},{"$error":"#VALUE!"},null,null,{"$f":"COUNTIFS('TRADE LOG'!$C$14:$C$733,\"<\"&'Bank Transfers'!D33,'TRADE LOG'!$C$14:$C$733,\">=\"&'Bank Transfers'!D32)","v":0},0,{"$nulls":7},18,"","",null,null,"Q","MU",null,"S","MU",38,"",""]
[null,null,20,{"$f":"IFERROR(INDEX(Datelog,SMALL('TRADE LOG'!$AD$15:$AD$9733,C34)),\"\")","v":""},"",{"$f":"IFERROR(INDEX('TRADE LOG'!$T$15:$T$733,SMALL('TRADE LOG'!$AD$15:$AD$733,C34)),\"\")","v":""},null,"",{"$nulls":3},{"$error":"#VALUE!"},null,null,{"$f":"COUNTIFS('TRADE LOG'!$C$14:$C$733,\"<\"&'Bank Transfers'!D34,'TRADE LOG'!$C$14:$C$733,\">=\"&'Bank Transfers'!D33)","v":0},0,{"$nulls":7},19,"","",null,null,"R","MI",null,"T","MI",40,"",""]
[null,null,21,{"$f":"IFERROR(INDEX(Datelog,SMALL('TRADE LOG'!$AD$15:$AD$9733,C35)),\"\")","v":""},"",{"$f":"IFERROR(INDEX('TRADE LOG'!$T$15:$T$733,SMALL('TRADE LOG'!$AD$15:$AD$733,C35)),\"\")","v":""},null,"",{"$nulls":3},{"$error":"#VALUE!"},null,null,{"$f":"COUNTIFS('TRADE LOG'!$C$14:$C$733,\"<\"&'Bank Transfers'!D35,'TRADE LOG'!$C$14:$C$733,\">=\"&'Bank Transfers'!D34)","v":0},0,{"$nulls":7},20,"","",null,null,"Z","MH",null,"U","MH",42,"",""]
[null,null,22,{"$f":"IFERROR(INDEX(Datelog,SMALL('TRADE LOG'!$AD$15:$AD$9733,C36)),\"\")","v":""},"",{"$f":"IFERROR(INDEX('TRADE LOG'!$T$15:$T$733,SMALL('TRADE LOG'!$AD$15:$AD$733,C36)),\"\")","v":""},null,"",{"$nulls":3},{"$error":"#VALUE!"},null,null,{"$f":"COUNTIFS('TRADE LOG'!$C$14:$C$733,\"<\"&'Bank Transfers'!D36,'TRADE LOG'!$C$14:$C$733,\">=\"&'Bank Transfers'!D35)","v":0},0,{"$nulls":7},21,"","",null,null,"P","AY",null,"V","AY",44,"",""]
[null,null,23,{"$f":"IFERROR(INDEX(Datelog,SMALL('TRADE LOG'!$AD$15:$AD$9733,C37)),\"\")","v":""},"",{"$f":"IFERROR(INDEX('TRADE LOG'!$T$15:$T$733,SMALL('TRADE LOG'!$AD$15:$AD$733,C37)),\"\")","v":""},null,"",{"$nulls":3},{"$error":"#VALUE!"},null,null,{"$f":"COUNTIFS('TRADE LOG'!$C$14:$C$733,\"<\"&'Bank Transfers'!D37,'TRADE LOG'!$C$14:$C$733,\">=\"&'Bank Transfers'!D36)","v":0},0,{"$nulls":7},22,"","",null,null,"X","MN",null,"W","MN",46,"",""]
[null,null,24,{"$f":"IFERROR(INDEX(Datelog,SMALL('TRADE LOG'!$AD$15:$AD$9733,C38)),\"\")","v":""},"",{"$f":"IFERROR(INDEX('TRADE LOG'!$T$15:$T$733,SMALL('TRADE LOG'!$AD$15:$AD$733,C38)),\"\")","v":""},null,"",{"$nulls":3},{"$error":"#VALUE!"},null,null,{"$f":"COUNTIFS('TRADE LOG'!$C$14:$C$733,\"<\"&'Bank Transfers'!D38,'TRADE LOG'!$C$14:$C$733,\">=\"&'Bank Transfers'!D37)","v":0},0,{"$nulls":7},23,"","",null,null,"W","AZ",null,"X","AZ",48,"",""]
[null,null,25,{"$f":"IFERROR(INDEX(Datelog,SMALL('TRADE LOG'!$AD$15:$AD$9733,C39)),\"\")","v":""},"",{"$f":"IFERROR(INDEX('TRADE LOG'!$T$15:$T$733,SMALL('TRADE LOG'!$AD$15:$AD$733,C39)),\"\")","v":""},null,"",{"$nulls":3},{"$error":"#VALUE!"},null,null,{"$f":"COUNTIFS('TRADE LOG'!$C$14:$C$733,\"<\"&'Bank Transfers'!D39,'TRADE LOG'!$C$14:$C$733,\">=\"&'Bank Transfers'!D38)","v":0},0,{"$nulls":7},24,"","",null,null,"S","EE",null,"Y","EE",50,"",""]
[null,null,26,{"$f":"IFERROR(INDEX(Datelog,SMALL('TRADE LOG'!$AD$15:$AD$9733,C40)),\"\")","v":""},"",{"$f":"IFERROR(INDEX('TRADE LOG'!$T$15:$T$733,SMALL('TRADE LOG'!$AD$15:$AD$733,C40)),\"\")","v":""},null,"",{"$nulls":3},{"$error":"#VALUE!"},null,null,{"$f":"COUNTIFS('TRADE LOG'!$C$14:$C$733,\"<\"&'Bank Transfers'!D40,'TRADE LOG'!$C$14:$C$733,\">=\"&'Bank Transfers'!D39)","v":0},0,{"$nulls":7},25,"","",null,null,"Y","Z4",null,"Z","Z4",52,"",""]
[null,null,27,{"$f":"IFERROR(INDEX(Datelog,SMALL('TRADE LOG'!$AD$15:$AD$9733,C41)),\"\")","v":""},"",{"$f":"IFERROR(INDEX('TRADE LOG'!$T$15:$T$733,SMALL('TRADE LOG'!$AD$15:$AD$733,C41)),\"\")","v":""},null,"",{"$nulls":3},{"$error":"#VALUE!"},null,null,{"$f":"COUNTIFS('TRADE LOG'!$C$14:$C$733,\"<\"&'Bank Transfers'!D41,'TRADE LOG'!$C$14:$C$733,\">=\"&'Bank Transfers'!D40)","v":0},0,{"$nulls":7},26,"","",{"$nulls":3},"LJ",null,"-","LJ",54,"",""]
[null,null,28,{"$f":"IFERROR(INDEX(Datelog,SMALL('TRADE LOG'!$AD$15:$AD$9733,C42)),\"\")","v":""},"",{"$f":"IFERROR(INDEX('TRADE LOG'!$T$15:$T$733,SMALL('TRADE LOG'!$AD$15:$AD$733,C42)),\"\")","v":""},null,"",{"$nulls":3},{"$error":"#VALUE!"},null,null,{"$f":"COUNTIFS('TRADE LOG'!$C$14:$C$733,\"<\"&'Bank Transfers'!D42,'TRADE LOG'!$C$14:$C$733,\">=\"&'Bank Transfers'!D41)","v":0},0,{"$nulls":7},27,"","",{"$nulls":3},"AB",null," ","AB",56,"",""]
[null,null,29,{"$f":"IFERROR(INDEX(Datelog,SMALL('TRADE LOG'!$AD$15:$AD$9733,C43)),\"\")","v":""},"",{"$f":"IFERROR(INDEX('TRADE LOG'!$T$15:$T$733,SMALL('TRADE LOG'!$AD$15:$AD$733,C43)),\"\")","v":""},null,"",{"$nulls":3},{"$error":"#VALUE!"},null,null,{"$f":"COUNTIFS('TRADE LOG'!$C$14:$C$733,\"<\"&'Bank Transfers'!D43,'TRADE LOG'!$C$14:$C$733,\">=\"&'Bank Transfers'!D42)","v":0},0,{"$nulls":7},28,"","",{"$nulls":3},"BA",null,"@","BA",58,"",""]
[null,null,30,{"$f":"IFERROR(INDEX(Datelog,SMALL('TRADE LOG'!$AD$15:$AD$9733,C44)),\"\")","v":""},"",{"$f":"IFERROR(INDEX('TRADE LOG'!$T$15:$T$733,SMALL('TRADE LOG'!$AD$15:$AD$733,C44)),\"\")","v":""},null,"",{"$nulls":3},{"$error":"#VALUE!"},null,null,{"$f":"COUNTIFS('TRADE LOG'!$C$14:$C$733,\"<\"&'Bank Transfers'!D44,'TRADE LOG'!$C$14:$C$733,\">=\"&'Bank Transfers'!D43)","v":0},0,{"$nulls":7},29,"","",{"$nulls":3},"RM",null,".","RM",60,"",""]
[null,null,31,{"$f":"IFERROR(INDEX(Datelog,SMALL('TRADE LOG'!$AD$15:$AD$9733,C45)),\"\")","v":""},"",{"$f":"IFERROR(INDEX('TRADE LOG'!$T$15:$T$733,SMALL('TRADE LOG'!$AD$15:$AD$733,C45)),\"\")","v":""},null,"",{"$nulls":3},{"$error":"#VALUE!"},null,null,{"$f":"COUNTIFS('TRADE LOG'!$C$14:$C$733,\"<\"&'Bank Transfers'!D45,'TRADE LOG'!$C$14:$C$733,\">=\"&'Bank Transfers'!D44)","v":0},0,{"$nulls":7},30,"","",null,null,"0","UT",null,"1","UT",62,"",""]
[null,null,32,{"$f":"IFERROR(INDEX(Datelog,SMALL('TRADE LOG'!$AD$15:$AD$9733,C46)),\"\")","v":""},"",{"$f":"IFERROR(INDEX('TRADE LOG'!$T$15:$T$733,SMALL('TRADE LOG'!$AD$15:$AD$733,C46)),\"\")","v":""},null,"",{"$nulls":3},{"$error":"#VALUE!"},null,null,{"$f":"COUNTIFS('TRADE LOG'!$C$14:$C$733,\"<\"&'Bank Transfers'!D46,'TRADE LOG'!$C$14:$C$733,\">=\"&'Bank Transfers'!D45)","v":0},0,{"$nulls":7},31,"","",null,null,"E","KB",null,"2","KB",64,"",""]
[null,null,33,{"$f":"IFERROR(INDEX(Datelog,SMALL('TRADE LOG'!$AD$15:$AD$9733,C47)),\"\")","v":""},"",{"$f":"IFERROR(INDEX('TRADE LOG'!$T$15:$T$733,SMALL('TRADE LOG'!$AD$15:$AD$733,C47)),\"\")","v":""},null,"",{"$nulls":3},{"$error":"#VALUE!"},null,null,{"$f":"COUNTIFS('TRADE LOG'!$C$14:$C$733,\"<\"&'Bank Transfers'!D47,'TRADE LOG'!$C$14:$C$733,\">=\"&'Bank Transfers'!D46)","v":0},0,{"$nulls":7},32,"","",null,null,"8","BI",null,"3","BI",66,"",""]
[null,null,34,{"$f":"IFERROR(INDEX(Datelog,SMALL('TRADE LOG'!$AD$15:$AD$9733,C48)),\"\")","v":""},"",{"$f":"IFERROR(INDEX('TRADE LOG'!$T$15:$T$733,SMALL('TRADE LOG'!$AD$15:$AD$733,C48)),\"\")","v":""},null,"",{"$nulls":3},{"$error":"#VALUE!"},null,null,{"$f":"COUNTIFS('TRADE LOG'!$C$14:$C$733,\"<\"&'Bank Transfers'!D48,'TRADE LOG'!$C$14:$C$733,\">=\"&'Bank Transfers'!D47)","v":0},0,{"$nulls":7},33,"","",null,null,"D","RL",null,"4","RL",68,"",""]
[null,null,35,{"$f":"IFERROR(INDEX(Datelog,SMALL('TRADE LOG'!$AD$15:$AD$9733,C49)),\"\")","v":""},"",{"$f":"IFERROR(INDEX('TRADE LOG'!$T$15:$T$733,SMALL('TRADE LOG'!$AD$15:$AD$733,C49)),\"\")","v":""},null,"",{"$nulls":3},{"$error":"#VALUE!"},null,null,{"$f":"COUNTIFS('TRADE LOG'!$C$14:$C$733,\"<\"&'Bank Transfers'!D49,'TRADE LOG'!$C$14:$C$733,\">=\"&'Bank Transfers'!D48)","v":0},0,{"$nulls":7},34,"","",null,null,"6","KH",null,"5","KH",70,"",""]
[null,null,36,{"$f":"IFERROR(INDEX(Datelog,SMALL('TRADE LOG'!$AD$15:$AD$9733,C50)),\"\")","v":""},"",{"$f":"IFERROR(INDEX('TRADE LOG'!$T$15:$T$733,SMALL('TRADE LOG'!$AD$15:$AD$733,C50)),\"\")","v":""},null,"",{"$nulls":3},{"$error":"#VALUE!"},null,null,{"$f":"COUNTIFS('TRADE LOG'!$C$14:$C$733,\"<\"&'Bank Transfers'!D50,'TRADE LOG'!$C$14:$C$733,\">=\"&'Bank Transfers'!D49)","v":0},0,{"$nulls":7},35,"","",null,null,"C","LL",null,"6","LL",72,"",""]
[null,null,37,{"$f":"IFERROR(INDEX(Datelog,SMALL('TRADE LOG'!$AD$15:$AD$9733,C51)),\"\")","v":""},"",{"$f":"IFERROR(INDEX('TRADE LOG'!$T$15:$T$733,SMALL('TRADE LOG'!$AD$15:$AD$733,C51)),\"\")","v":""},null,"",{"$nulls":3},{"$error":"#VALUE!"},null,null,{"$f":"COUNTIFS('TRADE LOG'!$C$14:$C$733,\"<\"&'Bank Transfers'!D51,'TRADE LOG'!$C$14:$C$733,\">=\"&'Bank Transfers'!D50)","v":0},0,{"$nulls":7},36,"","",null,null,"4","IQ",null,"7","IQ",74,"",""]
[null,null,38,{"$f":"IFERROR(INDEX(Datelog,SMALL('TRADE LOG'!$AD$15:$AD$9733,C52)),\"\")","v":""},"",{"$f":"IFERROR(INDEX('TRADE LOG'!$T$15:$T$733,SMALL('TRADE LOG'!$AD$15:$AD$733,C52)),\"\")","v":""},null,"",{"$nulls":3},{"$error":"#VALUE!"},null,null,{"$f":"COUNTIFS('TRADE LOG'!$C$14:$C$733,\"<\"&'Bank Transfers'!D52,'TRADE LOG'!$C$14:$C$733,\">=\"&'Bank Transfers'!D51)","v":0},0,{"$nulls":7},37,"","",null,null,"B","B4",null,"8","B4",76,"",""]
[null,null,39,{"$f":"IFERROR(INDEX(Datelog,SMALL('TRADE LOG'!$AD$15:$AD$9733,C53)),\"\")","v":""},"",{"$f":"IFERROR(INDEX('TRADE LOG'!$T$15:$T$733,SMALL('TRADE LOG'!$AD$15:$AD$733,C53)),\"\")","v":""},null,"",{"$nulls":3},{"$error":"#VALUE!"},null,null,{"$f":"COUNTIFS('TRADE LOG'!$C$14:$C$733,\"<\"&'Bank Transfers'!D53,'TRADE LOG'!$C$14:$C$733,\">=\"&'Bank Transfers'!D52)","v":0},0,{"$nulls":7},38,"","",null,null,"2","4R",null,"9","4R",78,"",""]
[null,null,40,{"$f":"IFERROR(INDEX(Datelog,SMALL('TRADE LOG'!$AD$15:$AD$9733,C54)),\"\")","v":""},"",{"$f":"IFERROR(INDEX('TRADE LOG'!$T$15:$T$733,SMALL('TRADE LOG'!$AD$15:$AD$733,C54)),\"\")","v":""},null,"",{"$nulls":3},{"$error":"#VALUE!"},null,null,{"$f":"COUNTIFS('TRADE LOG'!$C$14:$C$733,\"<\"&'Bank Transfers'!D54,'TRADE LOG'!$C$14:$C$733,\">=\"&'Bank Transfers'!D53)","v":0},0,{"$nulls":7},39,"","",null,null,"A","RI",null,"0","RI",80,"",""]
[null,null,41,{"$f":"IFERROR(INDEX(Datelog,SMALL('TRADE LOG'!$AD$15:$AD$9733,C55)),\"\")","v":""},"",{"$f":"IFERROR(INDEX('TRADE LOG'!$T$15:$T$733,SMALL('TRADE LOG'!$AD$15:$AD$733,C55)),\"\")","v":""},null,"",{"$nulls":3},{"$error":"#VALUE!"},null,null,{"$f":"COUNTIFS('TRADE LOG'!$C$14:$C$733,\"<\"&'Bank Transfers'!D55,'TRADE LOG'!$C$14:$C$733,\">=\"&'Bank Transfers'!D54)","v":0},0,{"$nulls":7},40,"","",{"$nulls":3},"IL",null,"_","IL"]
[null,null,42,{"$f":"IFERROR(INDEX(Datelog,SMALL('TRADE LOG'!$AD$15:$AD$9733,C56)),\"\")","v":""},"",{"$f":"IFERROR(INDEX('TRADE LOG'!$T$15:$T$733,SMALL('TRADE LOG'!$AD$15:$AD$733,C56)),\"\")","v":""},null,"",{"$nulls":3},{"$error":"#VALUE!"},null,null,{"$f":"COUNTIFS('TRADE LOG'!$C$14:$C$733,\"<\"&'Bank Transfers'!D56,'TRADE LOG'!$C$14:$C$733,\">=\"&'Bank Transfers'!D55)","v":0},0,{"$nulls":13},"YL",null,"ñ","YL"]
[null,null,43,{"$f":"IFERROR(INDEX(Datelog,SMALL('TRADE LOG'!$AD$15:$AD$9733,C57)),\"\")","v":""},"",{"$f":"IFERROR(INDEX('TRADE LOG'!$T$15:$T$733,SMALL('TRADE LOG'!$AD$15:$AD$733,C57)),\"\")","v":""},null,"",{"$nulls":3},{"$error":"#VALUE!"},null,null,{"$f":"COUNTIFS('TRADE LOG'!$C$14:$C$733,\"<\"&'Bank Transfers'!D57,'TRADE LOG'!$C$14:$C$733,\">=\"&'Bank Transfers'!D56)","v":0},0]
[null,null,44,{"$f":"IFERROR(INDEX(Datelog,SMALL('TRADE LOG'!$AD$15:$AD$9733,C58)),\"\")","v":""},"",{"$f":"IFERROR(INDEX('TRADE LOG'!$T$15:$T$733,SMALL('TRADE LOG'!$AD$15:$AD$733,C58)),\"\")","v":""},null,"",{"$nulls":3},{"$error":"#VALUE!"},null,null,{"$f":"COUNTIFS('TRADE LOG'!$C$14:$C$733,\"<\"&'Bank Transfers'!D58,'TRADE LOG'!$C$14:$C$733,\">=\"&'Bank Transfers'!D57)","v":0},0]
[null,null,45,{"$f":"IFERROR(INDEX(Datelog,SMALL('TRADE LOG'!$AD$15:$AD$9733,C59)),\"\")","v":""},"",{"$f":"IFERROR(INDEX('TRADE LOG'!$T$15:$T$733,SMALL('TRADE LOG'!$AD$15:$AD$733,C59)),\"\")","v":""},null,"",{"$nulls":3},{"$error":"#VALUE!"},null,null,{"$f":"COUNTIFS('TRADE LOG'!$C$14:$C$733,\"<\"&'Bank Transfers'!D59,'TRADE LOG'!$C$14:$C$733,\">=\"&'Bank Transfers'!D58)","v":0},0]
[null,null,46,{"$f":"IFERROR(INDEX(Datelog,SMALL('TRADE LOG'!$AD$15:$AD$9733,C60)),\"\")","v":""},"",{"$f":"IFERROR(INDEX('TRADE LOG'!$T$15:$T$733,SMALL('TRADE LOG'!$AD$15:$AD$733,C60)),\"\")","v":""},null,"",{"$nulls":3},{"$error":"#VALUE!"},null,null,{"$f":"COUNTIFS('TRADE LOG'!$C$14:$C$733,\"<\"&'Bank Transfers'!D60,'TRADE LOG'!$C$14:$C$733,\">=\"&'Bank Transfers'!D59)","v":0},0]
[null,null,47,{"$f":"IFERROR(INDEX(Datelog,SMALL('TRADE LOG'!$AD$15:$AD$9733,C61)),\"\")","v":""},"",{"$f":"IFERROR(INDEX('TRADE LOG'!$T$15:$T$733,SMALL('TRADE LOG'!$AD$15:$AD$733,C61)),\"\")","v":""},null,"",{"$nulls":3},{"$error":"#VALUE!"},null,null,{"$f":"COUNTIFS('TRADE LOG'!$C$14:$C$733,\"<\"&'Bank Transfers'!D61,'TRADE LOG'!$C$14:$C$733,\">=\"&'Bank Transfers'!D60)","v":0},0]
[null,null,48,{"$f":"IFERROR(INDEX(Datelog,SMALL('TRADE LOG'!$AD$15:$AD$9733,C62)),\"\")","v":""},"",{"$f":"IFERROR(INDEX('TRADE LOG'!$T$15:$T$733,SMALL('TRADE LOG'!$AD$15:$AD$733,C62)),\"\")","v":""},null,"",{"$nulls":3},{"$error":"#VALUE!"},null,null,{"$f":"COUNTIFS('TRADE LOG'!$C$14:$C$733,\"<\"&'Bank Transfers'!D62,'TRADE LOG'!$C$14:$C$733,\">=\"&'Bank Transfers'!D61)","v":0},0]
[null,null,49,{"$f":"IFERROR(INDEX(Datelog,SMALL('TRADE LOG'!$AD$15:$AD$9733,C63)),\"\")","v":""},"",{"$f":"IFERROR(INDEX('TRADE LOG'!$T$15:$T$733,SMALL('TRADE LOG'!$AD$15:$AD$733,C63)),\"\")","v":""},null,"",{"$nulls":3},{"$error":"#VALUE!"},null,null,{"$f":"COUNTIFS('TRADE LOG'!$C$14:$C$733,\"<\"&'Bank Transfers'!D63,'TRADE LOG'!$C$14:$C$733,\">=\"&'Bank Transfers'!D62)","v":0},0]
[null,null,50,{"$f":"IFERROR(INDEX(Datelog,SMALL('TRADE LOG'!$AD$15:$AD$9733,C64)),\"\")","v":""},"",{"$f":"IFERROR(INDEX('TRADE LOG'!$T$15:$T$733,SMALL('TRADE LOG'!$AD$15:$AD$733,C64)),\"\")","v":""},null,"",{"$nulls":3},{"$error":"#VALUE!"},null,null,{"$f":"COUNTIFS('TRADE LOG'!$C$14:$C$733,\"<\"&'Bank Transfers'!D64,'TRADE LOG'!$C$14:$C$733,\">=\"&'Bank Transfers'!D63)","v":0},0]
[null,null,51,{"$f":"IFERROR(INDEX(Datelog,SMALL('TRADE LOG'!$AD$15:$AD$9733,C65)),\"\")","v":""},"",{"$f":"IFERROR(INDEX('TRADE LOG'!$T$15:$T$733,SMALL('TRADE LOG'!$AD$15:$AD$733,C65)),\"\")","v":""},null,"",{"$nulls":3},{"$error":"#VALUE!"},null,null,{"$f":"COUNTIFS('TRADE LOG'!$C$14:$C$733,\"<\"&'Bank Transfers'!D65,'TRADE LOG'!$C$14:$C$733,\">=\"&'Bank Transfers'!D64)","v":0},0]
[null,null,52,{"$f":"IFERROR(INDEX(Datelog,SMALL('TRADE LOG'!$AD$15:$AD$9733,C66)),\"\")","v":""},"",{"$f":"IFERROR(INDEX('TRADE LOG'!$T$15:$T$733,SMALL('TRADE LOG'!$AD$15:$AD$733,C66)),\"\")","v":""},null,"",{"$nulls":3},{"$error":"#VALUE!"},null,null,{"$f":"COUNTIFS('TRADE LOG'!$C$14:$C$733,\"<\"&'Bank Transfers'!D66,'TRADE LOG'!$C$14:$C$733,\">=\"&'Bank Transfers'!D65)","v":0},0]
[null,null,53,{"$f":"IFERROR(INDEX(Datelog,SMALL('TRADE LOG'!$AD$15:$AD$9733,C67)),\"\")","v":""},"",{"$f":"IFERROR(INDEX('TRADE LOG'!$T$15:$T$733,SMALL('TRADE LOG'!$AD$15:$AD$733,C67)),\"\")","v":""},null,"",{"$nulls":3},{"$error":"#VALUE!"},null,null,{"$f":"COUNTIFS('TRADE LOG'!$C$14:$C$733,\"<\"&'Bank Transfers'!D67,'TRADE LOG'!$C$14:$C$733,\">=\"&'Bank Transfers'!D66)","v":0},0]
[null,null,54,{"$f":"IFERROR(INDEX(Datelog,SMALL('TRADE LOG'!$AD$15:$AD$9733,C68)),\"\")","v":""},"",{"$f":"IFERROR(INDEX('TRADE LOG'!$T$15:$T$733,SMALL('TRADE LOG'!$AD$15:$AD$733,C68)),\"\")","v":""},null,"",{"$nulls":3},{"$error":"#VALUE!"},null,null,{"$f":"COUNTIFS('TRADE LOG'!$C$14:$C$733,\"<\"&'Bank Transfers'!D68,'TRADE LOG'!$C$14:$C$733,\">=\"&'Bank Transfers'!D67)","v":0},0]
[null,null,55,{"$f":"IFERROR(INDEX(Datelog,SMALL('TRADE LOG'!$AD$15:$AD$9733,C69)),\"\")","v":""},"",{"$f":"IFERROR(INDEX('TRADE LOG'!$T$15:$T$733,SMALL('TRADE LOG'!$AD$15:$AD$733,C69)),\"\")","v":""},null,"",{"$nulls":3},{"$error":"#VALUE!"},null,null,{"$f":"COUNTIFS('TRADE LOG'!$C$14:$C$733,\"<\"&'Bank Transfers'!D69,'TRADE LOG'!$C$14:$C$733,\">=\"&'Bank Transfers'!D68)","v":0},0]
[null,null,56,{"$f":"IFERROR(INDEX(Datelog,SMALL('TRADE LOG'!$AD$15:$AD$9733,C70)),\"\")","v":""},"",{"$f":"IFERROR(INDEX('TRADE LOG'!$T$15:$T$733,SMALL('TRADE LOG'!$AD$15:$AD$733,C70)),\"\")","v":""},null,"",{"$nulls":3},{"$error":"#VALUE!"},null,null,{"$f":"COUNTIFS('TRADE LOG'!$C$14:$C$733,\"<\"&'Bank Transfers'!D70,'TRADE LOG'!$C$14:$C$733,\">=\"&'Bank Transfers'!D69)","v":0},0]
[null,null,57,{"$f":"IFERROR(INDEX(Datelog,SMALL('TRADE LOG'!$AD$15:$AD$9733,C71)),\"\")","v":""},"",{"$f":"IFERROR(INDEX('TRADE LOG'!$T$15:$T$733,SMALL('TRADE LOG'!$AD$15:$AD$733,C71)),\"\")","v":""},null,"",{"$nulls":3},{"$error":"#VALUE!"},null,null,{"$f":"COUNTIFS('TRADE LOG'!$C$14:$C$733,\"<\"&'Bank Transfers'!D71,'TRADE LOG'!$C$14:$C$733,\">=\"&'Bank Transfers'!D70)","v":0},0]
[null,null,58,{"$f":"IFERROR(INDEX(Datelog,SMALL('TRADE LOG'!$AD$15:$AD$9733,C72)),\"\")","v":""},"",{"$f":"IFERROR(INDEX('TRADE LOG'!$T$15:$T$733,SMALL('TRADE LOG'!$AD$15:$AD$733,C72)),\"\")","v":""},null,"",{"$nulls":3},{"$error":"#VALUE!"},null,null,{"$f":"COUNTIFS('TRADE LOG'!$C$14:$C$733,\"<\"&'Bank Transfers'!D72,'TRADE LOG'!$C$14:$C$733,\">=\"&'Bank Transfers'!D71)","v":0},0]
[null,null,59,{"$f":"IFERROR(INDEX(Datelog,SMALL('TRADE LOG'!$AD$15:$AD$9733,C73)),\"\")","v":""},"",{"$f":"IFERROR(INDEX('TRADE LOG'!$T$15:$T$733,SMALL('TRADE LOG'!$AD$15:$AD$733,C73)),\"\")","v":""},null,"",{"$nulls":3},{"$error":"#VALUE!"},null,null,{"$f":"COUNTIFS('TRADE LOG'!$C$14:$C$733,\"<\"&'Bank Transfers'!D73,'TRADE LOG'!$C$14:$C$733,\">=\"&'Bank Transfers'!D72)","v":0},0]
[null,null,60,{"$f":"IFERROR(INDEX(Datelog,SMALL('TRADE LOG'!$AD$15:$AD$9733,C74)),\"\")","v":""},"",{"$f":"IFERROR(INDEX('TRADE LOG'!$T$15:$T$733,SMALL('TRADE LOG'!$AD$15:$AD$733,C74)),\"\")","v":""},null,"",{"$nulls":3},{"$error":"#VALUE!"},null,null,{"$f":"COUNTIFS('TRADE LOG'!$C$14:$C$733,\"<\"&'Bank Transfers'!D74,'TRADE LOG'!$C$14:$C$733,\">=\"&'Bank Transfers'!D73)","v":0},0]
[null,null,61,{"$f":"IFERROR(INDEX(Datelog,SMALL('TRADE LOG'!$AD$15:$AD$9733,C75)),\"\")","v":""},"",{"$f":"IFERROR(INDEX('TRADE LOG'!$T$15:$T$733,SMALL('TRADE LOG'!$AD$15:$AD$733,C75)),\"\")","v":""},null,"",{"$nulls":3},{"$error":"#VALUE!"},null,null,{"$f":"COUNTIFS('TRADE LOG'!$C$14:$C$733,\"<\"&'Bank Transfers'!D75,'TRADE LOG'!$C$14:$C$733,\">=\"&'Bank Transfers'!D74)","v":0},0]
[null,null,62,{"$f":"IFERROR(INDEX(Datelog,SMALL('TRADE LOG'!$AD$15:$AD$9733,C76)),\"\")","v":""},"",{"$f":"IFERROR(INDEX('TRADE LOG'!$T$15:$T$733,SMALL('TRADE LOG'!$AD$15:$AD$733,C76)),\"\")","v":""},null,"",{"$nulls":3},{"$error":"#VALUE!"},null,null,{"$f":"COUNTIFS('TRADE LOG'!$C$14:$C$733,\"<\"&'Bank Transfers'!D76,'TRADE LOG'!$C$14:$C$733,\">=\"&'Bank Transfers'!D75)","v":0},0]
[null,null,63,{"$f":"IFERROR(INDEX(Datelog,SMALL('TRADE LOG'!$AD$15:$AD$9733,C77)),\"\")","v":""},"",{"$f":"IFERROR(INDEX('TRADE LOG'!$T$15:$T$733,SMALL('TRADE LOG'!$AD$15:$AD$733,C77)),\"\")","v":""},null,"",{"$nulls":3},{"$error":"#VALUE!"},null,null,{"$f":"COUNTIFS('TRADE LOG'!$C$14:$C$733,\"<\"&'Bank Transfers'!D77,'TRADE LOG'!$C$14:$C$733,\">=\"&'Bank Transfers'!D76)","v":0},0]
[null,null,64,{"$f":"IFERROR(INDEX(Datelog,SMALL('TRADE LOG'!$AD$15:$AD$9733,C78)),\"\")","v":""},"",{"$f":"IFERROR(INDEX('TRADE LOG'!$T$15:$T$733,SMALL('TRADE LOG'!$AD$15:$AD$733,C78)),\"\")","v":""},null,"",{"$nulls":3},{"$error":"#VALUE!"},null,null,{"$f":"COUNTIFS('TRADE LOG'!$C$14:$C$733,\"<\"&'Bank Transfers'!D78,'TRADE LOG'!$C$14:$C$733,\">=\"&'Bank Transfers'!D77)","v":0},0]
[null,null,65,{"$f":"IFERROR(INDEX(Datelog,SMALL('TRADE LOG'!$AD$15:$AD$9733,C79)),\"\")","v":""},{"$f":"IF(F79=\"\",\"\",IF(F79>0,\"Deposit\",\"Withdraw\"))","v":""},{"$f":"IFERROR(INDEX('TRADE LOG'!$T$15:$T$733,SMALL('TRADE LOG'!$AD$15:$AD$733,C79)),\"\")","v":""},null,"",{"$nulls":3},{"$error":"#VALUE!"},null,null,{"$f":"COUNTIFS('TRADE LOG'!$C$14:$C$733,\"<\"&'Bank Transfers'!D79,'TRADE LOG'!$C$14:$C$733,\">=\"&'Bank Transfers'!D78)","v":0},0]
[null,null,66,{"$f":"IFERROR(INDEX(Datelog,SMALL('TRADE LOG'!$AD$15:$AD$9733,C80)),\"\")","v":""},"",{"$f":"IFERROR(INDEX('TRADE LOG'!$T$15:$T$733,SMALL('TRADE LOG'!$AD$15:$AD$733,C80)),\"\")","v":""},null,{"$f":"F80","v":""},{"$nulls":3},{"$error":"#VALUE!"},null,null,{"$f":"COUNTIFS('TRADE LOG'!$C$14:$C$733,\"<\"&'Bank Transfers'!D80,'TRADE LOG'!$C$14:$C$733,\">=\"&'Bank Transfers'!D79)","v":0},0]
[null,null,{"$f":"C80+1","v":67},{"$f":"IFERROR(INDEX(Datelog,SMALL('TRADE LOG'!$AD$15:$AD$9733,C81)),\"\")","v":""},"",{"$f":"IFERROR(INDEX('TRADE LOG'!$T$15:$T$733,SMALL('TRADE LOG'!$AD$15:$AD$733,C81)),\"\")","v":""},null,"",{"$nulls":3},{"$f":"DATE(YEAR(D81),MONTH(D81),DAY(1))","v":{"$error":"#VALUE!"}},null,null,{"$f":"COUNTIFS('TRADE LOG'!$C$14:$C$733,\"<\"&'Bank Transfers'!D81,'TRADE LOG'!$C$14:$C$733,\">=\"&'Bank Transfers'!D80)","v":0},0]
[null,null,68,{"$f":"IFERROR(INDEX(Datelog,SMALL('TRADE LOG'!$AD$15:$AD$9733,C82)),\"\")","v":""},"",{"$f":"IFERROR(INDEX('TRADE LOG'!$T$15:$T$733,SMALL('TRADE LOG'!$AD$15:$AD$733,C82)),\"\")","v":""},null,"",{"$nulls":3},{"$error":"#VALUE!"},null,null,{"$f":"COUNTIFS('TRADE LOG'!$C$14:$C$733,\"<\"&'Bank Transfers'!D82,'TRADE LOG'!$C$14:$C$733,\">=\"&'Bank Transfers'!D81)","v":0},0]
[null,null,69,{"$f":"IFERROR(INDEX(Datelog,SMALL('TRADE LOG'!$AD$15:$AD$9733,C83)),\"\")","v":""},"",{"$f":"IFERROR(INDEX('TRADE LOG'!$T$15:$T$733,SMALL('TRADE LOG'!$AD$15:$AD$733,C83)),\"\")","v":""},null,"",{"$nulls":3},{"$error":"#VALUE!"},null,null,{"$f":"COUNTIFS('TRADE LOG'!$C$14:$C$733,\"<\"&'Bank Transfers'!D83,'TRADE LOG'!$C$14:$C$733,\">=\"&'Bank Transfers'!D82)","v":0},0]
[null,null,70,{"$f":"IFERROR(INDEX(Datelog,SMALL('TRADE LOG'!$AD$15:$AD$9733,C84)),\"\")","v":""},"",{"$f":"IFERROR(INDEX('TRADE LOG'!$T$15:$T$733,SMALL('TRADE LOG'!$AD$15:$AD$733,C84)),\"\")","v":""},null,"",{"$nulls":3},{"$error":"#VALUE!"},null,null,{"$f":"COUNTIFS('TRADE LOG'!$C$14:$C$733,\"<\"&'Bank Transfers'!D84,'TRADE LOG'!$C$14:$C$733,\">=\"&'Bank Transfers'!D83)","v":0},{"$f":"O84+P83","v":0}]
[null,null,71,{"$f":"IFERROR(INDEX(Datelog,SMALL('TRADE LOG'!$AD$15:$AD$9733,C85)),\"\")","v":""},"",{"$f":"IFERROR(INDEX('TRADE LOG'!$T$15:$T$733,SMALL('TRADE LOG'!$AD$15:$AD$733,C85)),\"\")","v":""},null,"",{"$nulls":3},{"$error":"#VALUE!"},null,null,{"$f":"COUNTIFS('TRADE LOG'!$C$14:$C$733,\"<\"&'Bank Transfers'!D85,'TRADE LOG'!$C$14:$C$733,\">=\"&'Bank Transfers'!D84)","v":0},0]
[null,null,72,{"$f":"IFERROR(INDEX(Datelog,SMALL('TRADE LOG'!$AD$15:$AD$9733,C86)),\"\")","v":""},"",{"$f":"IFERROR(INDEX('TRADE LOG'!$T$15:$T$733,SMALL('TRADE LOG'!$AD$15:$AD$733,C86)),\"\")","v":""},null,"",{"$nulls":3},{"$error":"#VALUE!"},null,null,{"$f":"COUNTIFS('TRADE LOG'!$C$14:$C$733,\"<\"&'Bank Transfers'!D86,'TRADE LOG'!$C$14:$C$733,\">=\"&'Bank Transfers'!D85)","v":0},0]
[null,null,73,{"$f":"IFERROR(INDEX(Datelog,SMALL('TRADE LOG'!$AD$15:$AD$9733,C87)),\"\")","v":""},"",{"$f":"IFERROR(INDEX('TRADE LOG'!$T$15:$T$733,SMALL('TRADE LOG'!$AD$15:$AD$733,C87)),\"\")","v":""},null,"",{"$nulls":3},{"$error":"#VALUE!"},null,null,{"$f":"COUNTIFS('TRADE LOG'!$C$14:$C$733,\"<\"&'Bank Transfers'!D87,'TRADE LOG'!$C$14:$C$733,\">=\"&'Bank Transfers'!D86)","v":0},0]
[null,null,74,{"$f":"IFERROR(INDEX(Datelog,SMALL('TRADE LOG'!$AD$15:$AD$9733,C88)),\"\")","v":""},"",{"$f":"IFERROR(INDEX('TRADE LOG'!$T$15:$T$733,SMALL('TRADE LOG'!$AD$15:$AD$733,C88)),\"\")","v":""},null,"",{"$nulls":3},{"$error":"#VALUE!"},null,null,{"$f":"COUNTIFS('TRADE LOG'!$C$14:$C$733,\"<\"&'Bank Transfers'!D88,'TRADE LOG'!$C$14:$C$733,\">=\"&'Bank Transfers'!D87)","v":0},0]
[null,null,75,{"$f":"IFERROR(INDEX(Datelog,SMALL('TRADE LOG'!$AD$15:$AD$9733,C89)),\"\")","v":""},"",{"$f":"IFERROR(INDEX('TRADE LOG'!$T$15:$T$733,SMALL('TRADE LOG'!$AD$15:$AD$733,C89)),\"\")","v":""},null,"",{"$nulls":3},{"$error":"#VALUE!"},null,null,{"$f":"COUNTIFS('TRADE LOG'!$C$14:$C$733,\"<\"&'Bank Transfers'!D89,'TRADE LOG'!$C$14:$C$733,\">=\"&'Bank Transfers'!D88)","v":0},0]
[null,null,76,{"$f":"IFERROR(INDEX(Datelog,SMALL('TRADE LOG'!$AD$15:$AD$9733,C90)),\"\")","v":""},"",{"$f":"IFERROR(INDEX('TRADE LOG'!$T$15:$T$733,SMALL('TRADE LOG'!$AD$15:$AD$733,C90)),\"\")","v":""},null,"",{"$nulls":3},{"$error":"#VALUE!"},null,null,{"$f":"COUNTIFS('TRADE LOG'!$C$14:$C$733,\"<\"&'Bank Transfers'!D90,'TRADE LOG'!$C$14:$C$733,\">=\"&'Bank Transfers'!D89)","v":0},0]
[null,null,77,{"$f":"IFERROR(INDEX(Datelog,SMALL('TRADE LOG'!$AD$15:$AD$9733,C91)),\"\")","v":""},"",{"$f":"IFERROR(INDEX('TRADE LOG'!$T$15:$T$733,SMALL('TRADE LOG'!$AD$15:$AD$733,C91)),\"\")","v":""},null,"",{"$nulls":3},{"$error":"#VALUE!"},null,null,{"$f":"COUNTIFS('TRADE LOG'!$C$14:$C$733,\"<\"&'Bank Transfers'!D91,'TRADE LOG'!$C$14:$C$733,\">=\"&'Bank Transfers'!D90)","v":0},0]
[null,null,78,{"$f":"IFERROR(INDEX(Datelog,SMALL('TRADE LOG'!$AD$15:$AD$9733,C92)),\"\")","v":""},"",{"$f":"IFERROR(INDEX('TRADE LOG'!$T$15:$T$733,SMALL('TRADE LOG'!$AD$15:$AD$733,C92)),\"\")","v":""},null,"",{"$nulls":3},{"$error":"#VALUE!"},null,null,{"$f":"COUNTIFS('TRADE LOG'!$C$14:$C$733,\"<\"&'Bank Transfers'!D92,'TRADE LOG'!$C$14:$C$733,\">=\"&'Bank Transfers'!D91)","v":0},0]
[null,null,79,{"$f":"IFERROR(INDEX(Datelog,SMALL('TRADE LOG'!$AD$15:$AD$9733,C93)),\"\")","v":""},"",{"$f":"IFERROR(INDEX('TRADE LOG'!$T$15:$T$733,SMALL('TRADE LOG'!$AD$15:$AD$733,C93)),\"\")","v":""},null,"",{"$nulls":3},{"$error":"#VALUE!"},null,null,{"$f":"COUNTIFS('TRADE LOG'!$C$14:$C$733,\"<\"&'Bank Transfers'!D93,'TRADE LOG'!$C$14:$C$733,\">=\"&'Bank Transfers'!D92)","v":0},0]
[null,null,80,{"$f":"IFERROR(INDEX(Datelog,SMALL('TRADE LOG'!$AD$15:$AD$9733,C94)),\"\")","v":""},"",{"$f":"IFERROR(INDEX('TRADE LOG'!$T$15:$T$733,SMALL('TRADE LOG'!$AD$15:$AD$733,C94)),\"\")","v":""},null,"",{"$nulls":3},{"$error":"#VALUE!"},null,null,{"$f":"COUNTIFS('TRADE LOG'!$C$14:$C$733,\"<\"&'Bank Transfers'!D94,'TRADE LOG'!$C$14:$C$733,\">=\"&'Bank Transfers'!D93)","v":0},0]
[null,null,81,{"$f":"IFERROR(INDEX(Datelog,SMALL('TRADE LOG'!$AD$15:$AD$9733,C95)),\"\")","v":""},"",{"$f":"IFERROR(INDEX('TRADE LOG'!$T$15:$T$733,SMALL('TRADE LOG'!$AD$15:$AD$733,C95)),\"\")","v":""},null,"",{"$nulls":3},{"$error":"#VALUE!"},null,null,{"$f":"COUNTIFS('TRADE LOG'!$C$14:$C$733,\"<\"&'Bank Transfers'!D95,'TRADE LOG'!$C$14:$C$733,\">=\"&'Bank Transfers'!D94)","v":0},0]
[null,null,82,{"$f":"IFERROR(INDEX(Datelog,SMALL('TRADE LOG'!$AD$15:$AD$9733,C96)),\"\")","v":""},"",{"$f":"IFERROR(INDEX('TRADE LOG'!$T$15:$T$733,SMALL('TRADE LOG'!$AD$15:$AD$733,C96)),\"\")","v":""},null,"",{"$nulls":3},{"$error":"#VALUE!"},null,null,{"$f":"COUNTIFS('TRADE LOG'!$C$14:$C$733,\"<\"&'Bank Transfers'!D96,'TRADE LOG'!$C$14:$C$733,\">=\"&'Bank Transfers'!D95)","v":0},0]
[null,null,83,{"$f":"IFERROR(INDEX(Datelog,SMALL('TRADE LOG'!$AD$15:$AD$9733,C97)),\"\")","v":""},"",{"$f":"IFERROR(INDEX('TRADE LOG'!$T$15:$T$733,SMALL('TRADE LOG'!$AD$15:$AD$733,C97)),\"\")","v":""},null,"",{"$nulls":3},{"$error":"#VALUE!"},null,null,{"$f":"COUNTIFS('TRADE LOG'!$C$14:$C$733,\"<\"&'Bank Transfers'!D97,'TRADE LOG'!$C$14:$C$733,\">=\"&'Bank Transfers'!D96)","v":0},0]
[null,null,84,{"$f":"IFERROR(INDEX(Datelog,SMALL('TRADE LOG'!$AD$15:$AD$9733,C98)),\"\")","v":""},"",{"$f":"IFERROR(INDEX('TRADE LOG'!$T$15:$T$733,SMALL('TRADE LOG'!$AD$15:$AD$733,C98)),\"\")","v":""},null,"",{"$nulls":3},{"$error":"#VALUE!"},null,null,{"$f":"COUNTIFS('TRADE LOG'!$C$14:$C$733,\"<\"&'Bank Transfers'!D98,'TRADE LOG'!$C$14:$C$733,\">=\"&'Bank Transfers'!D97)","v":0},0]
[null,null,85,{"$f":"IFERROR(INDEX(Datelog,SMALL('TRADE LOG'!$AD$15:$AD$9733,C99)),\"\")","v":""},"",{"$f":"IFERROR(INDEX('TRADE LOG'!$T$15:$T$733,SMALL('TRADE LOG'!$AD$15:$AD$733,C99)),\"\")","v":""},null,"",{"$nulls":3},{"$error":"#VALUE!"},null,null,{"$f":"COUNTIFS('TRADE LOG'!$C$14:$C$733,\"<\"&'Bank Transfers'!D99,'TRADE LOG'!$C$14:$C$733,\">=\"&'Bank Transfers'!D98)","v":0},0]
[null,null,86,{"$f":"IFERROR(INDEX(Datelog,SMALL('TRADE LOG'!$AD$15:$AD$9733,C100)),\"\")","v":""},"",{"$f":"IFERROR(INDEX('TRADE LOG'!$T$15:$T$733,SMALL('TRADE LOG'!$AD$15:$AD$733,C100)),\"\")","v":""},null,"",{"$nulls":3},{"$error":"#VALUE!"},null,null,{"$f":"COUNTIFS('TRADE LOG'!$C$14:$C$733,\"<\"&'Bank Transfers'!D100,'TRADE LOG'!$C$14:$C$733,\">=\"&'Bank Transfers'!D99)","v":0},0]
[null,null,87,{"$f":"IFERROR(INDEX(Datelog,SMALL('TRADE LOG'!$AD$15:$AD$9733,C101)),\"\")","v":""},"",{"$f":"IFERROR(INDEX('TRADE LOG'!$T$15:$T$733,SMALL('TRADE LOG'!$AD$15:$AD$733,C101)),\"\")","v":""},null,"",{"$nulls":3},{"$error":"#VALUE!"},null,null,{"$f":"COUNTIFS('TRADE LOG'!$C$14:$C$733,\"<\"&'Bank Transfers'!D101,'TRADE LOG'!$C$14:$C$733,\">=\"&'Bank Transfers'!D100)","v":0},0]
[null,null,88,{"$f":"IFERROR(INDEX(Datelog,SMALL('TRADE LOG'!$AD$15:$AD$9733,C102)),\"\")","v":""},"",{"$f":"IFERROR(INDEX('TRADE LOG'!$T$15:$T$733,SMALL('TRADE LOG'!$AD$15:$AD$733,C102)),\"\")","v":""},null,"",{"$nulls":3},{"$error":"#VALUE!"},null,null,{"$f":"COUNTIFS('TRADE LOG'!$C$14:$C$733,\"<\"&'Bank Transfers'!D102,'TRADE LOG'!$C$14:$C$733,\">=\"&'Bank Transfers'!D101)","v":0},0]
[null,null,89,{"$f":"IFERROR(INDEX(Datelog,SMALL('TRADE LOG'!$AD$15:$AD$9733,C103)),\"\")","v":""},"",{"$f":"IFERROR(INDEX('TRADE LOG'!$T$15:$T$733,SMALL('TRADE LOG'!$AD$15:$AD$733,C103)),\"\")","v":""},null,"",{"$nulls":3},{"$error":"#VALUE!"},null,null,{"$f":"COUNTIFS('TRADE LOG'!$C$14:$C$733,\"<\"&'Bank Transfers'!D103,'TRADE LOG'!$C$14:$C$733,\">=\"&'Bank Transfers'!D102)","v":0},0]
[null,null,90,{"$f":"IFERROR(INDEX(Datelog,SMALL('TRADE LOG'!$AD$15:$AD$9733,C104)),\"\")","v":""},"",{"$f":"IFERROR(INDEX('TRADE LOG'!$T$15:$T$733,SMALL('TRADE LOG'!$AD$15:$AD$733,C104)),\"\")","v":""},null,"",{"$nulls":3},{"$error":"#VALUE!"},null,null,{"$f":"COUNTIFS('TRADE LOG'!$C$14:$C$733,\"<\"&'Bank Transfers'!D104,'TRADE LOG'!$C$14:$C$733,\">=\"&'Bank Transfers'!D103)","v":0},0]
[null,null,91,{"$f":"IFERROR(INDEX(Datelog,SMALL('TRADE LOG'!$AD$15:$AD$9733,C105)),\"\")","v":""},"",{"$f":"IFERROR(INDEX('TRADE LOG'!$T$15:$T$733,SMALL('TRADE LOG'!$AD$15:$AD$733,C105)),\"\")","v":""},null,"",{"$nulls":3},{"$error":"#VALUE!"},null,null,{"$f":"COUNTIFS('TRADE LOG'!$C$14:$C$733,\"<\"&'Bank Transfers'!D105,'TRADE LOG'!$C$14:$C$733,\">=\"&'Bank Transfers'!D104)","v":0},0]
[null,null,92,{"$f":"IFERROR(INDEX(Datelog,SMALL('TRADE LOG'!$AD$15:$AD$9733,C106)),\"\")","v":""},"",{"$f":"IFERROR(INDEX('TRADE LOG'!$T$15:$T$733,SMALL('TRADE LOG'!$AD$15:$AD$733,C106)),\"\")","v":""},null,"",{"$nulls":3},{"$error":"#VALUE!"},null,null,{"$f":"COUNTIFS('TRADE LOG'!$C$14:$C$733,\"<\"&'Bank Transfers'!D106,'TRADE LOG'!$C$14:$C$733,\">=\"&'Bank Transfers'!D105)","v":0},0]
[null,null,93,{"$f":"IFERROR(INDEX(Datelog,SMALL('TRADE LOG'!$AD$15:$AD$9733,C107)),\"\")","v":""},"",{"$f":"IFERROR(INDEX('TRADE LOG'!$T$15:$T$733,SMALL('TRADE LOG'!$AD$15:$AD$733,C107)),\"\")","v":""},null,"",{"$nulls":3},{"$error":"#VALUE!"},null,null,{"$f":"COUNTIFS('TRADE LOG'!$C$14:$C$733,\"<\"&'Bank Transfers'!D107,'TRADE LOG'!$C$14:$C$733,\">=\"&'Bank Transfers'!D106)","v":0},0]
[null,null,94,{"$f":"IFERROR(INDEX(Datelog,SMALL('TRADE LOG'!$AD$15:$AD$9733,C108)),\"\")","v":""},"",{"$f":"IFERROR(INDEX('TRADE LOG'!$T$15:$T$733,SMALL('TRADE LOG'!$AD$15:$AD$733,C108)),\"\")","v":""},null,"",{"$nulls":3},{"$error":"#VALUE!"},null,null,{"$f":"COUNTIFS('TRADE LOG'!$C$14:$C$733,\"<\"&'Bank Transfers'!D108,'TRADE LOG'!$C$14:$C$733,\">=\"&'Bank Transfers'!D107)","v":0},0]
[null,null,95,{"$f":"IFERROR(INDEX(Datelog,SMALL('TRADE LOG'!$AD$15:$AD$9733,C109)),\"\")","v":""},"",{"$f":"IFERROR(INDEX('TRADE LOG'!$T$15:$T$733,SMALL('TRADE LOG'!$AD$15:$AD$733,C109)),\"\")","v":""},null,"",{"$nulls":3},{"$error":"#VALUE!"},null,null,{"$f":"COUNTIFS('TRADE LOG'!$C$14:$C$733,\"<\"&'Bank Transfers'!D109,'TRADE LOG'!$C$14:$C$733,\">=\"&'Bank Transfers'!D108)","v":0},0]
[null,null,96,{"$f":"IFERROR(INDEX(Datelog,SMALL('TRADE LOG'!$AD$15:$AD$9733,C110)),\"\")","v":""},"",{"$f":"IFERROR(INDEX('TRADE LOG'!$T$15:$T$733,SMALL('TRADE LOG'!$AD$15:$AD$733,C110)),\"\")","v":""},null,"",{"$nulls":3},{"$error":"#VALUE!"},null,null,{"$f":"COUNTIFS('TRADE LOG'!$C$14:$C$733,\"<\"&'Bank Transfers'!D110,'TRADE LOG'!$C$14:$C$733,\">=\"&'Bank Transfers'!D109)","v":0},0]
[null,null,97,{"$f":"IFERROR(INDEX(Datelog,SMALL('TRADE LOG'!$AD$15:$AD$9733,C111)),\"\")","v":""},"",{"$f":"IFERROR(INDEX('TRADE LOG'!$T$15:$T$733,SMALL('TRADE LOG'!$AD$15:$AD$733,C111)),\"\")","v":""},null,"",{"$nulls":3},{"$error":"#VALUE!"},null,null,{"$f":"COUNTIFS('TRADE LOG'!$C$14:$C$733,\"<\"&'Bank Transfers'!D111,'TRADE LOG'!$C$14:$C$733,\">=\"&'Bank Transfers'!D110)","v":0},0]
[null,null,98,{"$f":"IFERROR(INDEX(Datelog,SMALL('TRADE LOG'!$AD$15:$AD$9733,C112)),\"\")","v":""},"",{"$f":"IFERROR(INDEX('TRADE LOG'!$T$15:$T$733,SMALL('TRADE LOG'!$AD$15:$AD$733,C112)),\"\")","v":""},null,"",{"$nulls":3},{"$error":"#VALUE!"},null,null,{"$f":"COUNTIFS('TRADE LOG'!$C$14:$C$733,\"<\"&'Bank Transfers'!D112,'TRADE LOG'!$C$14:$C$733,\">=\"&'Bank Transfers'!D111)","v":0},0]
[null,null,99,{"$f":"IFERROR(INDEX(Datelog,SMALL('TRADE LOG'!$AD$15:$AD$9733,C113)),\"\")","v":""},"",{"$f":"IFERROR(INDEX('TRADE LOG'!$T$15:$T$733,SMALL('TRADE LOG'!$AD$15:$AD$733,C113)),\"\")","v":""},null,"",{"$nulls":3},{"$error":"#VALUE!"},null,null,{"$f":"COUNTIFS('TRADE LOG'!$C$14:$C$733,\"<\"&'Bank Transfers'!D113,'TRADE LOG'!$C$14:$C$733,\">=\"&'Bank Transfers'!D112)","v":0},0]
[null,null,100,{"$f":"IFERROR(INDEX(Datelog,SMALL('TRADE LOG'!$AD$15:$AD$9733,C114)),\"\")","v":""},"",{"$f":"IFERROR(INDEX('TRADE LOG'!$T$15:$T$733,SMALL('TRADE LOG'!$AD$15:$AD$733,C114)),\"\")","v":""},null,"",{"$nulls":3},{"$error":"#VALUE!"},null,null,{"$f":"COUNTIFS('TRADE LOG'!$C$14:$C$733,\"<\"&'Bank Transfers'!D114,'TRADE LOG'!$C$14:$C$733,\">=\"&'Bank Transfers'!D113)","v":0},0]

{"sheet":"DASHBOARD","index":3,"n_rows":92,"n_cols":56,"rows_kept":92,"hidden":true,"merged":[[3,6,3,13],[5,2,5,3],[5,15,5,16],[5,17,5,18],[6,2,6,3],[6,15,11,16],[6,17,11,18],[7,2,7,3],[11,2,11,3],[12,2,12,3],[13,2,13,3],[14,2,14,3],[15,2,15,3],[16,2,16,3],[18,6,18,13],[20,16,20,17],[21,2,21,3],[21,16,21,17],[22,2,22,3],[23,2,23,3],[24,2,24,3],[25,2,25,3],[26,2,26,3],[27,2,27,3],[29,6,29,13],[30,8,30,9],[30,10,30,11],[30,12,30,13],[31,2,31,3],[31,8,31,9],[31,12,31,13],[32,12,32,13],[33,12,33,13],[34,8,34,9],[34,12,34,13],[35,8,35,9],[35,12,35,13],[36,8,36,9],[36,12,36,13],[37,8,37,9],[37,12,37,13],[38,8,38,9],[38,10,38,11],[38,12,38,13],[39,8,39,9],[39,12,39,13],[40,8,40,9],[40,12,40,13],[41,8,41,9],[41,10,41,11],[41,12,41,13],[42,8,42,9],[42,10,42,11],[42,12,42,13],[43,3,43,4],[43,8,43,9],[43,10,43,11],[43,12,43,13],[44,6,44,13],[57,8,57,11]]}
[{"$nulls":5}," ",{"$nulls":8}," "," "," "," "," "," ",{"$nulls":6},"bar chart"]
[null,null,{"$f":"IF('TRADE LOG'!D4=\"invalid user\",\"Invalid User\",Nameko)","v":"Rocketsheets"},{"$nulls":3},{"$f":"'Bank Transfers'!H5","v":{"v":50000,"d":"$ 50,000.0"}},null,{"$f":"'MONTHLY REPORT'!K14","v":{"v":4271.419999999997,"d":"$ 4,271.4"}},null,{"$f":"'Bank Transfers'!I5","v":0},null,{"$f":"'Bank Transfers'!J10","v":{"v":54271.420000000006,"d":"$ 54,271.4"}},{"$nulls":9},{"$f":"SETTINGS!O3","v":"USD"},{"$nulls":3},{"$f":"'MONTHLY REPORT'!AD6","v":{"v":13805.110000000002,"d":"13,805"}},{"$nulls":11},"Distribution of gains and losses chart",{"$nulls":4},{"$f":"IF(AS2=\"Wins & Losses\",0,1)","v":0},{"$f":"SETTINGS!AD186","v":"Wins & Losses"},{"$f":"IF(AR2=1,\"AVE. PROFIT & LOSS\",\"NUMBER OF TRADES\")","v":"NUMBER OF TRADES"}]
[null,null,"           TRADING JOURNAL",{"$nulls":3},"CAPITAL",null,"NET PROFIT/LOSS",null,"WITHDRAWALS",null,"END BALANCE",{"$nulls":5},{"$f":"HOME!S3","v":"V.1.0"},{"$nulls":7},{"$f":"-'MONTHLY REPORT'!AE6","v":{"v":9533.689999999997,"d":"9,534"}},{"$nulls":3},"from","to","end","loss","gain",{"$nulls":3},"range from","AUG","Label","negative chart","positive","Ave.Profit/Loss","Positive","Negative"]
[{"$nulls":6},"O V E R A L L    S U M M A R Y",{"$nulls":23},{"$f":"AE5+7","v":"2023-03-18"},{"$nulls":7},0.19999999999999998,null,"20% above",null,{"$f":"COUNTIFS(PercentPandL,\">=\"&AM4,'TRADE LOG'!$BK$15:$BK$9733,1)","v":0},{"$f":"IFERROR(SUMIFS(ProfitLoss,PercentPandL,\">=\"&AM4)/AQ4,0)","v":0},{"$f":"IF($AR$2=1,AR4,AQ4)","v":0}]
[null,"     OVERALL PERFORMANCE",{"$nulls":4},"   DISTRIBUTION OF GAINS AND LOSSES",{"$nulls":8},"     OVERALL TRADE STATISTICS",{"$nulls":14},{"$f":"X8-7","v":"2023-03-11"},{"$f":"(AE5+7)-1","v":"2023-03-17"},{"$f":"'MONTHLY REPORT'!J14","v":{"v":54271.42,"d":"54,271"}},{"$f":"SUMIFS(ProfitLoss,'TRADE LOG'!$AT$15:$AT$9733,\">\"&AE5,'TRADE LOG'!$AT$15:$AT$9733,\"<=\"&AE4,'TRADE LOG'!$BK$15:$BK$9733,-1)","v":0},{"$f":"SUMIFS(ProfitLoss,'TRADE LOG'!$AT$15:$AT$9733,\">\"&AE5,'TRADE LOG'!$AT$15:$AT$9733,\"<=\"&AE4,'TRADE LOG'!$BK$15:$BK$9733,1)","v":0},{"$nulls":3},0.18,0.19999999999999998,"18% to 20%",null,{"$f":"COUNTIFS(PercentPandL,\">=\"&AM5,PercentPandL,\"<\"&AN5,'TRADE LOG'!$BK$15:$BK$9733,1)","v":0},{"$f":"IFERROR(SUMIFS(ProfitLoss,PercentPandL,\">=\"&AM5,PercentPandL,\"<\"&AN5)/AQ5,0)","v":0},{"$f":"IF($AR$2=1,AR5,AQ5)","v":0}]
[null,{"$f":"'TRADE STATISTICS'!AO6","v":"Long Net P&L"},{"$f":"'TRADE STATISTICS'!AO5","v":{"v":4364.370000000006,"d":"$4,364.4"}},null,{"$f":"'TRADE STATISTICS'!AQ5","v":{"v":0.08728740000000013,"d":"▲ 8.7%  "}},{"$nulls":25},{"$f":"AE5-7","v":"2023-03-04"},"2023-03-10",{"$f":"AG5-(AH5+AI5)","v":{"v":54271.42,"d":"54,271"}},{"$f":"SUMIFS(ProfitLoss,'TRADE LOG'!$AT$15:$AT$9733,\">\"&AE6,'TRADE LOG'!$AT$15:$AT$9733,\"<=\"&AE5,'TRADE LOG'!$BK$15:$BK$9733,-1)","v":0},{"$f":"SUMIFS(ProfitLoss,'TRADE LOG'!$AT$15:$AT$9733,\">\"&AE6,'TRADE LOG'!$AT$15:$AT$9733,\"<=\"&AE5,'TRADE LOG'!$BK$15:$BK$9733,1)","v":0},{"$nulls":3},0.16,0.18,"16% to 18%",null,{"$f":"COUNTIFS(PercentPandL,\">=\"&AM6,PercentPandL,\"<\"&AN6,'TRADE LOG'!$BK$15:$BK$9733,1)","v":0},0,0]
[null,{"$f":"'TRADE STATISTICS'!AO8","v":"Short Net P&L"},{"$f":"'TRADE STATISTICS'!AO7","v":{"v":-92.95000000000002,"d":"$-93.0"}},null,{"$f":"'TRADE STATISTICS'!AQ7","v":{"v":-1.8590000000000004E-3,"d":"▼ -0.2%  "}},{"$nulls":17},"to date",{"$f":"'MONTHLY REPORT'!X3","v":"2023-03-17"},{"$nulls":3},"%P&L","p&l",null,"2023-02-25","2023-03-03",{"v":54271.42,"d":"54,271"},{"$f":"SUMIFS(ProfitLoss,'TRADE LOG'!$AT$15:$AT$9733,\">\"&AE7,'TRADE LOG'!$AT$15:$AT$9733,\"<=\"&AE6,'TRADE LOG'!$BK$15:$BK$9733,-1)","v":0},{"$f":"SUMIFS(ProfitLoss,'TRADE LOG'!$AT$15:$AT$9733,\">\"&AE7,'TRADE LOG'!$AT$15:$AT$9733,\"<=\"&AE6,'TRADE LOG'!$BK$15:$BK$9733,1)","v":0},{"$nulls":3},0.14,0.16,"14% to 16%",null,{"$f":"COUNTIFS(PercentPandL,\">=\"&AM7,PercentPandL,\"<\"&AN7,'TRADE LOG'!$BK$15:$BK$9733,1)","v":2},{"v":748.5250000000001,"d":"748.53"},2]
[null,{"$f":"'TRADE STATISTICS'!AO10","v":"Total Net P&L"},{"$f":"C6+C7","v":{"v":4271.420000000006,"d":"$4,271.4"}},null,{"$f":"'TRADE STATISTICS'!AQ9","v":{"v":0.08542840000000013,"d":"▲ 8.5%  "}},{"$nulls":18},{"$f":"IF(WEEKDAY(X7)=7,X7+7,X7+(7-WEEKDAY(X7)))","v":"2023-03-18"},{"$f":"AG5","v":{"v":54271.42,"d":"54,271"}},null,"this week",{"$f":"IFERROR((AC8)/Y8,0)","v":{"v":0,"d":"0.00%"}},{"$f":"AH5+AI5","v":0},null,"2023-02-18","2023-02-24",{"v":54271.42,"d":"54,271"},{"$f":"SUMIFS(ProfitLoss,'TRADE LOG'!$AT$15:$AT$9733,\">\"&AE8,'TRADE LOG'!$AT$15:$AT$9733,\"<=\"&AE7,'TRADE LOG'!$BK$15:$BK$9733,-1)","v":0},{"$f":"SUMIFS(ProfitLoss,'TRADE LOG'!$AT$15:$AT$9733,\">\"&AE8,'TRADE LOG'!$AT$15:$AT$9733,\"<=\"&AE7,'TRADE LOG'!$BK$15:$BK$9733,1)","v":0},{"$nulls":3},0.12000000000000001,0.14,"12% to 14%",null,{"$f":"COUNTIFS(PercentPandL,\">=\"&AM8,PercentPandL,\"<\"&AN8,'TRADE LOG'!$BK$15:$BK$9733,1)","v":2},532.35,2]
[{"$nulls":23},{"$f":"'MONTHLY REPORT'!X3-X6","v":"2023-03-17"},{"$f":"AG6","v":{"v":54271.42,"d":"54,271"}},null,"pre week",{"$f":"IFERROR((AC9)/Y9,\"\")","v":{"v":0,"d":"0.00%"}},{"$f":"AH6+AI6","v":0},null,"2023-02-11","2023-02-17",{"v":54271.42,"d":"54,271"},{"$f":"SUMIFS(ProfitLoss,'TRADE LOG'!$AT$15:$AT$9733,\">\"&AE9,'TRADE LOG'!$AT$15:$AT$9733,\"<=\"&AE8,'TRADE LOG'!$BK$15:$BK$9733,-1)","v":0},{"$f":"SUMIFS(ProfitLoss,'TRADE LOG'!$AT$15:$AT$9733,\">\"&AE9,'TRADE LOG'!$AT$15:$AT$9733,\"<=\"&AE8,'TRADE LOG'!$BK$15:$BK$9733,1)","v":0},{"$nulls":3},0.1,0.12000000000000001,"10% to 12%",null,{"$f":"COUNTIFS(PercentPandL,\">=\"&AM9,PercentPandL,\"<\"&AN9,'TRADE LOG'!$BK$15:$BK$9733,1)","v":3},581.84,3]
[{"$nulls":30},"2023-02-04","2023-02-10",{"v":54271.42,"d":"54,271"},{"$f":"SUMIFS(ProfitLoss,'TRADE LOG'!$AT$15:$AT$9733,\">\"&AE10,'TRADE LOG'!$AT$15:$AT$9733,\"<=\"&AE9,'TRADE LOG'!$BK$15:$BK$9733,-1)","v":0},{"$f":"SUMIFS(ProfitLoss,'TRADE LOG'!$AT$15:$AT$9733,\">\"&AE10,'TRADE LOG'!$AT$15:$AT$9733,\"<=\"&AE9,'TRADE LOG'!$BK$15:$BK$9733,1)","v":0},{"$nulls":3},0.08,0.1,"8% to 10%",null,{"$f":"COUNTIFS(PercentPandL,\">=\"&AM10,PercentPandL,\"<\"&AN10,'TRADE LOG'!$BK$15:$BK$9733,1)","v":2},{"v":431.02500000000003,"d":"431.03"},2]
[null,"     TOP/BOTTOM CUMULATIVE TRADES",null,null,"More Details",{"$nulls":17},"Profit Rate",{"$f":"'TRADE STATISTICS'!BK6","v":{"v":0.6347220299050317,"d":"63.5%"}},{"$nulls":6},"2023-01-28","2023-02-03",{"v":54271.42,"d":"54,271"},{"$f":"SUMIFS(ProfitLoss,'TRADE LOG'!$AT$15:$AT$9733,\">\"&AE11,'TRADE LOG'!$AT$15:$AT$9733,\"<=\"&AE10,'TRADE LOG'!$BK$15:$BK$9733,-1)","v":0},{"$f":"SUMIFS(ProfitLoss,'TRADE LOG'!$AT$15:$AT$9733,\">\"&AE11,'TRADE LOG'!$AT$15:$AT$9733,\"<=\"&AE10,'TRADE LOG'!$BK$15:$BK$9733,1)","v":0},{"$nulls":3},0.06,0.08,"6% to 8%",null,{"$f":"COUNTIFS(PercentPandL,\">=\"&AM11,PercentPandL,\"<\"&AN11,'TRADE LOG'!$BK$15:$BK$9733,1)","v":5},714.05,5]
[null,{"$f":"IFERROR('TRADE LOG'!CC3,\"\")","v":"AUDUSD"},{"$f":"IFERROR('TRADE LOG'!CA3,0)","v":{"v":4767.850009999999,"d":"$4,767.9"}},null,{"$f":"IFERROR('TRADE LOG'!CD3,0)","v":{"v":0.0462377547799344,"d":"▲ 4.6%  "}},{"$nulls":17},"Loss Rate",{"$f":"'TRADE STATISTICS'!BL6","v":0.3652779700949684},{"$nulls":6},"2023-01-21","2023-01-27",{"v":54271.42,"d":"54,271"},{"$f":"SUMIFS(ProfitLoss,'TRADE LOG'!$AT$15:$AT$9733,\">\"&AE12,'TRADE LOG'!$AT$15:$AT$9733,\"<=\"&AE11,'TRADE LOG'!$BK$15:$BK$9733,-1)","v":0},{"$f":"SUMIFS(ProfitLoss,'TRADE LOG'!$AT$15:$AT$9733,\">\"&AE12,'TRADE LOG'!$AT$15:$AT$9733,\"<=\"&AE11,'TRADE LOG'!$BK$15:$BK$9733,1)","v":0},{"$nulls":3},0.04,0.06,"4% to 6%",null,{"$f":"COUNTIFS(PercentPandL,\">=\"&AM12,PercentPandL,\"<\"&AN12,'TRADE LOG'!$BK$15:$BK$9733,1)","v":3},{"v":389.51666666666665,"d":"389.52"},3]
[null,{"$f":"IFERROR('TRADE LOG'!CC4,\"\")","v":"GBPUSD"},{"$f":"IFERROR('TRADE LOG'!CA4,0)","v":{"v":527.30004,"d":"$527.3"}},null,{"$f":"IFERROR('TRADE LOG'!CD4,0)","v":{"v":0.004753504187823538,"d":"▲ 0.5%  "}},{"$nulls":10},{"$f":"'TRADE STATISTICS'!BI4","v":25},{"$f":"'TRADE STATISTICS'!BJ4","v":30},{"$f":"'TRADE STATISTICS'!BK4","v":{"v":552.2044000000001,"d":"552"}},{"$f":"'TRADE STATISTICS'!BL4","v":{"v":317.78966666666656,"d":"318"}},{"$nulls":11},"2023-01-14","2023-01-20",{"v":54271.42,"d":"54,271"},{"$f":"SUMIFS(ProfitLoss,'TRADE LOG'!$AT$15:$AT$9733,\">\"&AE13,'TRADE LOG'!$AT$15:$AT$9733,\"<=\"&AE12,'TRADE LOG'!$BK$15:$BK$9733,-1)","v":0},{"$f":"SUMIFS(ProfitLoss,'TRADE LOG'!$AT$15:$AT$9733,\">\"&AE13,'TRADE LOG'!$AT$15:$AT$9733,\"<=\"&AE12,'TRADE LOG'!$BK$15:$BK$9733,1)","v":0},{"$nulls":3},0.02,0.04,"2% to 4%",null,{"$f":"COUNTIFS(PercentPandL,\">=\"&AM13,PercentPandL,\"<\"&AN13,'TRADE LOG'!$BK$15:$BK$9733,1)","v":5},{"v":554.0939999999999,"d":"554.09"},5]
[null,{"$f":"IFERROR('TRADE LOG'!CC5,\"\")","v":""},{"$f":"IFERROR('TRADE LOG'!CA5,0)","v":""},null,{"$f":"IFERROR('TRADE LOG'!CD5,0)","v":""},{"$nulls":10},"Win Trades","Loss Trades","Ave. Profit","Ave. Loss",{"$nulls":11},"2023-01-07","2023-01-13",{"v":54271.42,"d":"54,271"},{"$f":"SUMIFS(ProfitLoss,'TRADE LOG'!$AT$15:$AT$9733,\">\"&AE14,'TRADE LOG'!$AT$15:$AT$9733,\"<=\"&AE13,'TRADE LOG'!$BK$15:$BK$9733,-1)","v":0},{"$f":"SUMIFS(ProfitLoss,'TRADE LOG'!$AT$15:$AT$9733,\">\"&AE14,'TRADE LOG'!$AT$15:$AT$9733,\"<=\"&AE13,'TRADE LOG'!$BK$15:$BK$9733,1)","v":0},{"$nulls":3},0,0.02,"0% to 2%",null,{"$f":"COUNTIFS(PercentPandL,\">=\"&AM14,PercentPandL,\"<\"&AN14,'TRADE LOG'!$BK$15:$BK$9733,1)","v":3},{"v":375.50666666666666,"d":"375.51"},3]
[null,{"$f":"IFERROR('TRADE LOG'!CC7,\"\")","v":"EURUSD"},{"$f":"IFERROR('TRADE LOG'!CA7,0)","v":{"v":-419.12997000000104,"d":"$-419.1"}},null,{"$f":"IFERROR('TRADE LOG'!CD7,0)","v":{"v":-2.1770770162758777E-3,"d":"▼ -0.2%  "}},{"$nulls":10},{"$f":"I37","v":{"v":0.06820304474998616,"d":"6.8%"}},{"$f":"I38","v":{"v":-0.04451900858594662,"d":"-4.5%"}},{"$f":"IFERROR(P13/Q13,\"\")","v":{"v":0.8333333333333334,"d":"0.8 : 1"}},{"$f":"IFERROR(R13/S13,\"\")","v":{"v":1.7376411441949557,"d":"1.7 : 1"}},{"$nulls":3},"profitxwin",{"$f":"I32*R13","v":251.00200000000004},{"$nulls":6},"2022-12-31","2023-01-06",{"v":54271.42,"d":"54,271"},{"$f":"SUMIFS(ProfitLoss,'TRADE LOG'!$AT$15:$AT$9733,\">\"&AE15,'TRADE LOG'!$AT$15:$AT$9733,\"<=\"&AE14,'TRADE LOG'!$BK$15:$BK$9733,-1)","v":0},{"$f":"SUMIFS(ProfitLoss,'TRADE LOG'!$AT$15:$AT$9733,\">\"&AE15,'TRADE LOG'!$AT$15:$AT$9733,\"<=\"&AE14,'TRADE LOG'!$BK$15:$BK$9733,1)","v":0},{"$nulls":3},-0.02,0,"0% to -2%",{"$f":"COUNTIFS(PercentPandL,\">=\"&AM15,PercentPandL,\"<\"&AN15,'TRADE LOG'!$BK$15:$BK$9733,-1)","v":13},null,{"$f":"IFERROR(SUMIFS(ProfitLoss,PercentPandL,\">=\"&AM15,PercentPandL,\"<\"&AN15)/AP15,0)","v":{"v":-308.5515384615385,"d":"(308.55)"}},null,{"$f":"ABS(IF($AR$2=1,AR15,AP15))","v":13}]
[null,{"$f":"IFERROR('TRADE LOG'!CC8,\"\")","v":"XAUUSD"},{"$f":"IFERROR('TRADE LOG'!CA8,0)","v":{"v":-409.99998,"d":"$-410.0"}},null,{"$f":"IFERROR('TRADE LOG'!CD8,0)","v":{"v":-7.8782063821153487E-5,"d":"▼ -0.0%  "}},{"$nulls":10},"Ave. Win %","Ave.Loss%","W/L Ratio","P/L Ratio",{"$nulls":3},"lossxloss%",{"$f":"(1-I32)*S13","v":173.33981818181812},{"$nulls":6},"2022-12-24","2022-12-30",{"v":54271.42,"d":"54,271"},{"$f":"SUMIFS(ProfitLoss,'TRADE LOG'!$AT$15:$AT$9733,\">\"&AE16,'TRADE LOG'!$AT$15:$AT$9733,\"<=\"&AE15,'TRADE LOG'!$BK$15:$BK$9733,-1)","v":0},{"$f":"SUMIFS(ProfitLoss,'TRADE LOG'!$AT$15:$AT$9733,\">\"&AE16,'TRADE LOG'!$AT$15:$AT$9733,\"<=\"&AE15,'TRADE LOG'!$BK$15:$BK$9733,1)","v":0},{"$nulls":3},-0.04,-0.02,"-2% to -4%",{"$f":"COUNTIFS(PercentPandL,\">=\"&AM16,PercentPandL,\"<\"&AN16,'TRADE LOG'!$BK$15:$BK$9733,-1)","v":5},null,{"v":-343.13199999999995,"d":"(343.13)"},null,{"$f":"ABS(IF($AR$2=1,AR16,AP16))","v":5}]
[null,{"$f":"IFERROR('TRADE LOG'!CC9,\"\")","v":"USDCAD"},{"$f":"IFERROR('TRADE LOG'!CA9,0)","v":{"v":-128.9099400000001,"d":"$-128.9"}},null,{"$f":"IFERROR('TRADE LOG'!CD9,0)","v":{"v":-5.8599785539124535E-4,"d":"▼ -0.1%  "}},{"$nulls":10},"Profit Factor:",{"$f":"IFERROR(X15/X16,0)","v":{"v":1.4480342868291298,"d":"1.45"}},"Expectancy:",{"$f":"X15-X16","v":{"v":77.66218181818192,"d":"$77.7"}},{"$nulls":11},"2022-12-17","2022-12-23",{"v":54271.42,"d":"54,271"},{"$f":"SUMIFS(ProfitLoss,'TRADE LOG'!$AT$15:$AT$9733,\">\"&AE17,'TRADE LOG'!$AT$15:$AT$9733,\"<=\"&AE16,'TRADE LOG'!$BK$15:$BK$9733,-1)","v":0},{"$f":"SUMIFS(ProfitLoss,'TRADE LOG'!$AT$15:$AT$9733,\">\"&AE17,'TRADE LOG'!$AT$15:$AT$9733,\"<=\"&AE16,'TRADE LOG'!$BK$15:$BK$9733,1)","v":0},{"$nulls":3},-0.06,-0.04,"-4% to -6%",{"$f":"COUNTIFS(PercentPandL,\">=\"&AM17,PercentPandL,\"<\"&AN17,'TRADE LOG'!$BK$15:$BK$9733,-1)","v":5},null,{"v":-266.17999999999995,"d":"(266.18)"},null,{"$f":"ABS(IF($AR$2=1,AR17,AP17))","v":5}]
[{"$nulls":37},{"$f":"AI18+AH18","v":0},-0.08,-0.06,"-6% to -8%",{"$f":"COUNTIFS(PercentPandL,\">=\"&AM18,PercentPandL,\"<\"&AN18,'TRADE LOG'!$BK$15:$BK$9733,-1)","v":2},null,{"v":-526.475,"d":"(526.48)"},null,2]
[{"$nulls":6},"P E R F O R M A N C E",{"$nulls":31},-0.1,-0.08,"-8% to -10%",{"$f":"COUNTIFS(PercentPandL,\">=\"&AM19,PercentPandL,\"<\"&AN19,'TRADE LOG'!$BK$15:$BK$9733,-1)","v":1},null,{"v":-297.65,"d":"(297.65)"},null,1]
[null,"    PERFORMANCE PER PERIOD",null,null,"Review Monthly Report ►",null,"PERFORMANCE CURVE",null,null,"Last Number of Trades",{"$nulls":5},"  WEEKLY PERFORMANCE CURVE",{"$nulls":14},"periodic report",null,"Period","from","to","Gain/loss","Beg. Capital","%change",-0.12000000000000001,-0.1,"-10% to -12%",{"$f":"COUNTIFS(PercentPandL,\">=\"&AM20,PercentPandL,\"<\"&AN20,'TRADE LOG'!$BK$15:$BK$9733,-1)","v":2},null,{"v":-357.65,"d":"(357.65)"},null,2]
[{"$nulls":15},"  This Week:",{"$f":"DASHBOARD!AC8","v":0},null,{"$f":"AB8","v":0},{"$nulls":19},-0.14,-0.12000000000000001,"-12% to -14%",{"$f":"COUNTIFS(PercentPandL,\">=\"&AM21,PercentPandL,\"<\"&AN21,'TRADE LOG'!$BK$15:$BK$9733,-1)","v":0},null,0,null,0]
[null,"This Month:",{"$f":"DASHBOARD!AJ23","v":0},null,{"$f":"DASHBOARD!AL23","v":0},{"$nulls":10},"  Prev. Week:",{"$f":"DASHBOARD!AC9","v":0},null,{"$f":"AB9","v":0},{"$nulls":12},"previous",{"$f":"DATE(YEAR(AG23),MONTH(AG23)-1,DAY(1))","v":"2023-02-01"},{"$f":"DATE(YEAR(AG22),MONTH(AG22),DAY(1))","v":"2023-02-01"},{"$f":"DATE(YEAR(AG22),MONTH(AG22)+1,DAY(1)-1)","v":"2023-02-28"},{"$nulls":3},-0.16,-0.14,"-14% to -16%",{"$f":"COUNTIFS(PercentPandL,\">=\"&AM22,PercentPandL,\"<\"&AN22,'TRADE LOG'!$BK$15:$BK$9733,-1)","v":0},null,0,null,0]
[null,"1st Quarter:",{"$f":"DASHBOARD!AJ24","v":0},null,{"$f":"DASHBOARD!AL24","v":0},{"$nulls":26},"current",{"$f":"'MONTHLY REPORT'!X3","v":"2023-03-17"},{"$f":"DATE(YEAR(AG23),MONTH(AG23),DAY(1))","v":"2023-03-01"},{"$f":"DATE(YEAR(AG23),MONTH(AG23)+1,DAY(1)-1)","v":"2023-03-31"},{"$f":"SUMIFS('TRADE LOG'!$BD$15:$BD$9733,'TRADE LOG'!$AT$15:$AT$9733,\">=\"&AH23,'TRADE LOG'!$AT$15:$AT$9733,\"<=\"&AI23)","v":0},{"$f":"IFERROR(INDEX('MONTHLY REPORT'!$E$15:$E$89,MATCH(AH23,'MONTHLY REPORT'!$Z$15:$Z$89,0)),0)","v":54271.420000000006},{"$f":"IFERROR(AJ23/AK23,0)","v":0},-0.18,-0.16,"-16% to -18%",{"$f":"COUNTIFS(PercentPandL,\">=\"&AM23,PercentPandL,\"<\"&AN23,'TRADE LOG'!$BK$15:$BK$9733,-1)","v":1},null,{"v":-196.53,"d":"(196.53)"},null,1]
[null,"2nd Quarter:",{"$f":"DASHBOARD!AJ25","v":0},null,{"$f":"DASHBOARD!AL25","v":0},{"$nulls":27},"Q1",{"$f":"DATE(YEAR(AG23),MONTH(1),DAY(1))","v":"2023-01-01"},{"$f":"DATE(YEAR(AH24),MONTH(AH24)+3,DAY(1)-1)","v":"2023-03-31"},{"$f":"SUMIFS('TRADE LOG'!$BD$15:$BD$9733,'TRADE LOG'!$AT$15:$AT$9733,\">=\"&AH24,'TRADE LOG'!$AT$15:$AT$9733,\"<=\"&AI24)","v":0},{"$f":"IFERROR(INDEX('MONTHLY REPORT'!$E$15:$E$89,MATCH(AH24,'MONTHLY REPORT'!$Z$15:$Z$89,0)),'Bank Transfers'!$H$15)","v":54271.420000000006},0,-0.19999999999999998,-0.18,"-18% to -20%",{"$f":"COUNTIFS(PercentPandL,\">=\"&AM24,PercentPandL,\"<\"&AN24,'TRADE LOG'!$BK$15:$BK$9733,-1)","v":1},null,{"v":-213.53,"d":"(213.53)"},null,1]
[null,"3rd Quarter:",{"$f":"DASHBOARD!AJ26","v":0},null,{"$f":"DASHBOARD!AL26","v":0},{"$nulls":27},"Q2",{"$f":"DATE(YEAR(AI24),MONTH(AI24)+1,DAY(1))","v":"2023-04-01"},{"$f":"DATE(YEAR(AH25),MONTH(AH25)+3,DAY(1)-1)","v":"2023-06-30"},{"$f":"SUMIFS('TRADE LOG'!$BD$15:$BD$9733,'TRADE LOG'!$AT$15:$AT$9733,\">=\"&AH25,'TRADE LOG'!$AT$15:$AT$9733,\"<=\"&AI25)","v":0},{"$f":"IFERROR(INDEX('MONTHLY REPORT'!$E$15:$E$89,MATCH(AH25,'MONTHLY REPORT'!$Z$15:$Z$89,0)),'Bank Transfers'!$H$15)","v":50000},0,-0.19999999999999998,null,"-20% below",{"$f":"COUNTIFS(PercentPandL,\"<\"&AM25,'TRADE LOG'!$BK$15:$BK$9733,-1)","v":0},null,{"$f":"IFERROR(SUMIFS(ProfitLoss,PercentPandL,\"<\"&AM25)/AP25,0)","v":0},null,0]
[null,"4th Quarter:",{"$f":"DASHBOARD!AJ27","v":0},null,{"$f":"DASHBOARD!AL27","v":0},{"$nulls":18},2999,{"$nulls":8},"Q3",{"$f":"DATE(YEAR(AI25),MONTH(AI25)+1,DAY(1))","v":"2023-07-01"},{"$f":"DATE(YEAR(AH26),MONTH(AH26)+3,DAY(1)-1)","v":"2023-09-30"},{"$f":"SUMIFS('TRADE LOG'!$BD$15:$BD$9733,'TRADE LOG'!$AT$15:$AT$9733,\">=\"&AH26,'TRADE LOG'!$AT$15:$AT$9733,\"<=\"&AI26)","v":0},{"$f":"IFERROR(INDEX('MONTHLY REPORT'!$E$15:$E$89,MATCH(AH26,'MONTHLY REPORT'!$Z$15:$Z$89,0)),'Bank Transfers'!$H$15)","v":50000},0]
[null,"Year To Date:",{"$f":"DASHBOARD!AJ28","v":0},null,{"$f":"DASHBOARD!AL28","v":0},{"$nulls":16},"chart y max",{"$f":"'TRADE LOG'!BH4","v":{"v":54280,"d":"54,280.00"}},{"$f":"'TRADE LOG'!BI4","v":56},{"$nulls":4},"max",{"$f":"IFERROR(MAX(AG5:AG17)*1.03,1)","v":55899.5626},null,null,"Q4",{"$f":"DATE(YEAR(AI26),MONTH(AI26)+1,DAY(1))","v":"2023-10-01"},{"$f":"DATE(YEAR(AH27),MONTH(AH27)+3,DAY(1)-1)","v":"2023-12-31"},{"$f":"SUMIFS('TRADE LOG'!$BD$15:$BD$9733,'TRADE LOG'!$AT$15:$AT$9733,\">=\"&AH27,'TRADE LOG'!$AT$15:$AT$9733,\"<=\"&AI27)","v":0},{"$f":"IFERROR(INDEX('MONTHLY REPORT'!$E$15:$E$89,MATCH(AH27,'MONTHLY REPORT'!$Z$15:$Z$89,0)),'Bank Transfers'!$H$15)","v":50000},0]
[null,"Previous YTD:",{"$f":"DASHBOARD!AJ29","v":0},null,{"$f":"DASHBOARD!AL29","v":0},{"$nulls":16},"chart y min",{"$f":"'TRADE LOG'!BH5","v":48980},{"$f":"'TRADE LOG'!BI5","v":6},{"$nulls":4},"min",{"$f":"IFERROR(MIN(AG5:AG17)*0.97,0)","v":52643.2774},null,null,"YTD",{"$f":"AH24","v":"2023-01-01"},{"$f":"AG23","v":"2023-03-17"},{"$f":"SUM(AJ24:AJ27)","v":0},{"$f":"IFERROR(INDEX('MONTHLY REPORT'!$E$15:$E$89,MATCH(AH28,'MONTHLY REPORT'!$Z$15:$Z$89,0)),'Bank Transfers'!$H$15)","v":54271.420000000006},0]
[{"$nulls":3},{"$f":"\"As of \"&TEXT(SETTINGS!AH2,\"mmmm-dd,yyy\")","v":"As of March-17,2023"},{"$nulls":27},{"$f":"MAX($AF$30,AH29)","v":44562},"PYTD",{"$f":"DATE(YEAR(AG23)-1,MONTH(1),DAY(1))","v":"2022-01-01"},{"$f":"DATE(YEAR(AH29)+1,MONTH(1),DAY(1)-1)","v":"2022-12-31"},{"$f":"SUMIFS('TRADE LOG'!$BD$15:$BD$9733,'TRADE LOG'!$AT$15:$AT$9733,\">=\"&AH29,'TRADE LOG'!$AT$15:$AT$9733,\"<=\"&AI29)","v":0},{"$f":"IFERROR(INDEX('MONTHLY REPORT'!$E$15:$E$89,MATCH(AH29,'MONTHLY REPORT'!$Z$15:$Z$89,0)),'Bank Transfers'!$H$15)","v":54271.420000000006},0]
[{"$nulls":22},{"$f":"SETTINGS!AA13","v":"REWARD-RISK RATIO"},{"$f":"\"     SETUP WIN% VS. \"&W30","v":"     SETUP WIN% VS. REWARD-RISK RATIO"},{"$nulls":6},{"$f":"DATE(YEAR(AG23),MONTH(1),DAY(1))","v":44927},{"$f":"MIN('MONTHLY REPORT'!$Z$15:$Z$89,AE30)","v":43952},"Period"]
[null,"     DRAWDOWN & WIN STREAK",{"$nulls":4},"   STATISTICS",null,"ALL TRADES",null,"     LAST 20 TRADES",null,"REMARKS",null,null,{"$f":"X30","v":"     SETUP WIN% VS. REWARD-RISK RATIO"},{"$nulls":5},"last 20 trades"]
[null,"Max Drawdown:",{"$f":"'TRADE LOG'!BM5","v":{"v":-2179.8800000000047,"d":"$-2,179.9"}},null,{"$f":"'TRADE LOG'!BL5","v":{"v":-0.040518855781178816,"d":"▼ -4.1%  "}},null,"Win rate%:",null,{"$f":"'TRADE STATISTICS'!BI6","v":{"v":0.45454545454545453,"d":"45.5%"}},null,null,{"$f":"IFERROR(V32,\"\")","v":{"v":0.3,"d":"30.0%"}},{"$f":"IFERROR(((L32-I32)/ABS(I32)),\"\")","v":-0.34},{"$nulls":8},{"$f":"V34/(V34+V35)","v":0.3},{"$f":"MAX(AI43:AI92)","v":37},{"$f":"W32+14","v":51},{"$nulls":5},{"$f":"'TRADE LOG'!AE1","v":55},{"$f":"SETTINGS!S4","v":2},{"$f":"SETTINGS!S5","v":{"v":0.1,"d":"10%"}},"RISK-MULTIPLE EVALUATION",null,"POSSIBLE CAUSE"]
[null,"Consecutive Wins:",{"$f":"'TRADE LOG'!BM7","v":{"v":1391.7499999999998,"d":"$1,391.8"}},null,{"$f":"'TRADE LOG'!$BL$7","v":{"v":5,"d":"5 Trades  "}},null,"Largest Profit:",null,{"$f":"MAX(ProfitLoss)","v":{"v":2273.5,"d":"$2,273.5"}},null,{"$f":"IFERROR(MAX(INDIRECT(\"'Trade Log'!bd\"&X32):INDIRECT(\"'Trade Log'!bd\"&X33)),0)","v":{"v":2273.5,"d":"$2,273.5"}},null,{"$f":"IFERROR(((K33-I33)/ABS(I33)),\"\")","v":0},{"$nulls":8},{"$f":"1-V32","v":0.7},{"$f":"AK43","v":56},{"$f":"W33+14","v":70},{"$nulls":3},{"$f":"COUNTIF('TRADE LOG'!$W$15:$W$9733,\"<-\"&1+AF32)","v":5},null,"< -1R",{"$f":"AL33/(AH33+AH34+AH35)","v":{"v":0.7931034482758621,"d":"79%"}},"of loss trades may due to late exit, over allocate or hope","Loss trades > -1R risk:",{"$f":"AB33/$AD$32","v":{"v":0.09090909090909091,"d":"9%"}},"of loss trades may due to late exit, over allocate or hope",null,"Over allocate, Hope",{"$f":"LARGE(AH33:AH35,1)","v":0.41818181818181815},null,{"$f":"INDEX(AI33:AI35,MATCH(AL33,AH33:AH35,0))","v":"of loss trades may due to early exit, under allocate or fear"}]
[null,"Consecutive Losses:",{"$f":"'TRADE LOG'!BM6","v":{"v":-1015.3599999999999,"d":"$-1,015.4"}},null,{"$f":"'TRADE LOG'!$BL$6","v":{"v":5,"d":"5 Trades  "}},null,"Largest Loss:",null,{"$f":"MIN(ProfitLoss)","v":{"v":-835.3,"d":"$-835.3"}},null,{"$f":"IFERROR(MIN(INDIRECT(\"'Trade Log'!bd\"&X32):INDIRECT(\"'Trade Log'!bd\"&X33)),0)","v":{"v":-738.23,"d":"$-738.2"}},null,{"$f":"IFERROR(((K34-I34)/ABS(I34)),\"\")","v":0.11620974500179569},{"$nulls":8},{"$f":"COUNTIF(INDIRECT(\"'Trade Log'!bk\"&X32):INDIRECT(\"'Trade Log'!bk\"&X33),1)","v":6},{"$nulls":5},{"$f":"COUNTIFS('TRADE LOG'!$W$15:$W$9733,\">-\"&1+AF32,'TRADE LOG'!$W$15:$W$9733,\"<=-\"&1-AF32)","v":1},null,"-1R",null,"Loss trades within 1R:","Loss trades within 1R:",{"v":0.01818181818181818,"d":"2%"},"of loss trades is as planned or properly position sized",null,"Position sized, as planned"]
[null,"Max Consecutive Profit:",{"$f":"'TRADE LOG'!BL9","v":{"v":2572.9,"d":"$2,572.9"}},null,{"$f":"IFERROR('TRADE LOG'!BM9,0)","v":{"v":4,"d":"4 Trades  "}},null,"Largest Win %:",null,{"$f":"IF(COUNT('MONTHLY REPORT'!X15)=0,MAX(MAX(PercentPandL),SETTINGS!S71),MAX(PercentPandL))","v":{"v":0.15096108069507752,"d":"15.10%"}},null,null,{"$f":"IFERROR(MAX(INDIRECT(\"'Trade Log'!be\"&X32):INDIRECT(\"'Trade Log'!be\"&X33)),0)","v":{"v":0.15096108069507752,"d":"15.10%"}},{"$f":"IFERROR(((L35-I35)/ABS(I35)),\"\")","v":0},{"$nulls":8},{"$f":"COUNTIF(INDIRECT(\"'Trade Log'!bk\"&X32):INDIRECT(\"'Trade Log'!bk\"&X33),-1)","v":14},{"$nulls":5},{"$f":"COUNTIFS('TRADE LOG'!$W$15:$W$9733,\"<=-\"&AF32,'TRADE LOG'!$W$15:$W$9733,\">-\"&1-AF32)","v":23},null,"0R to -1R",null,"Loss trades < -1R risk:","Loss trades < -1R risk:",{"v":0.41818181818181815,"d":"42%"},"of loss trades may due to early exit, under allocate or fear",null,"Under allocate , fear"]
[null,"Max Consecutive Loss:",{"$f":"'TRADE LOG'!BL8","v":{"v":-1745.67,"d":"$-1,745.7"}},null,{"$f":"IFERROR('TRADE LOG'!BM8,0)","v":{"v":3,"d":"3 Trades  "}},null,"Largest Loss %:",null,{"$f":"IF(COUNT('MONTHLY REPORT'!X15)=0,MIN(MIN(PercentPandL),SETTINGS!S72),MIN(PercentPandL))","v":{"v":-0.19361302782739118,"d":"-19.36%"}},null,null,{"$f":"IFERROR(MIN(INDIRECT(\"'Trade Log'!be\"&X32):INDIRECT(\"'Trade Log'!be\"&X33)),0)","v":{"v":-0.023795709842209245,"d":"-2.38%"}},{"$f":"IFERROR(((L36-I36)/ABS(I36)),\"\")","v":0.8770965460887091},{"$nulls":8},{"$f":"SUMIFS('TRADE LOG'!$AF$15:$AF$9733,'TRADE LOG'!$U$15:$U$9733,\">0\",Datelog,\">0\")","v":{"v":0.31285879629285773,"d":"0.31"}},{"$nulls":5},{"$f":"COUNTIFS('TRADE LOG'!$W$15:$W$9733,\">-\"&AF32,'TRADE LOG'!$W$15:$W$9733,\"<\"&AF32)","v":2},null,"0R",null,"Fair trades within 0R:","Fair trades within 0R:",{"v":0.03636363636363636,"d":"4%"},"No plan, Bored",null,"No plan, Bored"]
[{"$nulls":6},"Ave. Win% per trade:",null,{"$f":"IFERROR(SUMIFS(PercentPandL,PercentPandL,\">0\",'TRADE LOG'!$Q$15:$Q$9733,\">0\")/$P$13,0)","v":{"v":0.06820304474998616,"d":"6.82%"}},null,null,{"$f":"IFERROR(SUMIF(INDIRECT(\"'Trade Log'!bk\"&X32):INDIRECT(\"'Trade Log'!bk\"&X33),1,INDIRECT(\"'Trade Log'!be\"&X32):INDIRECT(\"'Trade Log'!be\"&X33))/V34,0)","v":{"v":0.064646206687625,"d":"6.46%"}},{"$f":"IFERROR(((L37-I37)/ABS(I37)),\"\")","v":-0.05215072252858456},{"$nulls":8},{"$f":"SUMIFS('TRADE LOG'!AF15:AF9733,'TRADE LOG'!$U$15:$U$9733,\"<=0\",Datelog,\">0\")","v":{"v":0.36825231480179355,"d":"0.37"}},{"$nulls":5},{"$f":"COUNTIFS('TRADE LOG'!$W$15:$W$9733,\"<\"&AE32-AF32,'TRADE LOG'!$W$15:$W$9733,\">\"&AF32)","v":20},null,{"$f":"\"0R to \"&AE32&\"R\"","v":"0R to 2R"},{"$f":"AL37/(AH37+AH38+AH39)","v":{"v":0.8333333333333333,"d":"83%"}},"of win trades may due to early exit, under allocate or fear","Win trades < 2R target:",{"v":0.36363636363636365,"d":"36%"},"of win trades may due to early exit, under allocate or fear",null,"Under allocate , fear",{"$f":"LARGE(AH37:AH39,1)","v":0.36363636363636365},null,{"$f":"INDEX(AI37:AI39,MATCH(AL37,AH37:AH39,0))","v":"of win trades may due to early exit, under allocate or fear"}]
[null,"     DURATION","WIN","LOSS","ALL TRADES",null,"Ave. Loss% per trade:",null,{"$f":"IFERROR(SUMIFS(PercentPandL,PercentPandL,\"<=0\",'TRADE LOG'!$Q$15:$Q$9733,\">0\")/$Q$13,0)","v":{"v":-0.04451900858594662,"d":"-4.45%"}},null,null,{"$f":"IFERROR(SUMIF(INDIRECT(\"'Trade Log'!bk\"&X32):INDIRECT(\"'Trade Log'!bk\"&X33),-1,INDIRECT(\"'Trade Log'!be\"&X32):INDIRECT(\"'Trade Log'!be\"&X33))/V35,0)","v":{"v":-0.01560650808541007,"d":"-1.56%"}},{"$f":"IFERROR(((L38-I38)/ABS(I38)),\"\")","v":0.6494416973531482},{"$nulls":8},{"$f":"V36+V37","v":{"v":0.6811111110946513,"d":"0.68"}},null,null,"EXP",null,null,{"$f":"COUNTIFS('TRADE LOG'!$W$15:$W$9733,\">=\"&AE32-AF32,'TRADE LOG'!$W$15:$W$9733,\"<=\"&AE32+AF32)","v":1},null,{"$f":"AE32&\"R\"","v":"2R"},null,"Win trades within 2R :","Win trades within 2R :",{"v":0.01818181818181818,"d":"2%"},"of win trades is as planned or properly position sized",null,"Position sized, as planned",{"$nulls":17},"max",{"$f":"ROUNDUP(MAX(AK46:BD46)*1.1,0)","v":14}]
[null,"Average Duration",{"$f":"IFERROR(V36/$P$13,0)","v":{"v":0.01251435185171431,"d":"0.01 d"}},{"$f":"IFERROR(V37/$Q$13,0)","v":{"v":0.012275077160059785,"d":"0.01 d"}},{"$f":"IFERROR(V38/($Q$13+P13),0)","v":{"v":0.012383838383539115,"d":"0.01 d"}},null,"Reward-to-Risk Ratio:",null,{"$f":"IFERROR((I37)/-(I38),0)","v":{"v":1.5319982837963717,"d":"1.53 : 1"}},null,{"$f":"IFERROR((L37)/-(L38),0)","v":{"v":4.142259519799966,"d":"4.14 : 1"}},null,{"$f":"IFERROR(((K39-I39)/ABS(I39)),\"\")","v":1.703827780756536},{"$nulls":8},{"$f":"SUMIFS('TRADE LOG'!$BI$15:$BI$9733,'TRADE LOG'!$BK$15:$BK$9733,1)/V42","v":{"v":0.3824186205457955,"d":"38%"}},"win allocation",null,"PF",null,null,{"$f":"COUNTIF('TRADE LOG'!$W$15:$W$9733,\">\"&AE32+AF32)","v":3},null,{"$f":"\">\"&AE32&\"R\"","v":">2R"},null,"Win trades > 2R target:","Win trades > 2R target:",{"v":0.05454545454545454,"d":"5%"},"of win trades may due to over allocate or greed",null,"Over allocate, Greed",null,null,{"$f":"CONCATENATE(TEXT(AE37,\"0%\"),\" \",AN37)","v":"83% of win trades may due to early exit, under allocate or fear"},{"$nulls":14},"min",{"$f":"ROUNDDOWN(MIN(AK46:BD46)*0.9,0)","v":7}]
[null,"Average Allocation",{"$f":"IFERROR(V39/$P$13,0)","v":{"v":0.01529674482183182,"d":"1.5%"}},{"$f":"IFERROR(V40/$Q$13,0)","v":{"v":0.02447519632398126,"d":"2.4%"}},{"$f":"IFERROR(V41/($Q$13+$P$13),0)","v":{"v":0.02030317291391334,"d":"2.0%"}},null,"Ave. Profit per trade:",null,{"$f":"R13","v":{"v":552.2044000000001,"d":"$552.2"}},null,{"$f":"IFERROR(SUMIF(INDIRECT(\"'Trade Log'!bk\"&X32):INDIRECT(\"'Trade Log'!bk\"&X33),1,INDIRECT(\"'Trade Log'!bd\"&X32):INDIRECT(\"'Trade Log'!bd\"&X33))/V34,0)","v":{"v":891.2533333333332,"d":"$891.3"}},null,0.6139917272179162,{"$nulls":8},{"$f":"SUMIFS('TRADE LOG'!$BI$15:$BI$9733,'TRADE LOG'!$BK$15:$BK$9733,-1)/V42","v":{"v":0.7342558897194378,"d":"73%"}},"loss allocation",{"$nulls":16},{"$f":"CONCATENATE(TEXT(AE33,\"0%\"),\" \",AN33)","v":"79% of loss trades may due to early exit, under allocate or fear"}]
[{"$nulls":6},"Ave. Loss per trade:",null,{"$f":"-S13","v":{"v":-317.78966666666656,"d":"$-317.8"}},null,{"$f":"IFERROR(SUMIF(INDIRECT(\"'Trade Log'!bk\"&X32):INDIRECT(\"'Trade Log'!bk\"&X33),-1,INDIRECT(\"'Trade Log'!bd\"&X32):INDIRECT(\"'Trade Log'!bd\"&X33))/V35,0)","v":{"v":-348.23214285714295,"d":"$-348.2"}},null,-0.09579441808096255,{"$nulls":8},{"$f":"SUMIFS('TRADE LOG'!$BI$15:$BI$9733,'TRADE LOG'!$BK$15:$BK$9733,\"<>0\")/V42","v":{"v":1.1166745102652336,"d":"112%"}},"total allocation"]
[null,"     MONEY MANAGEMENT",{"$nulls":4},"Profit:Loss (Edge) Ratio:",null,{"$f":"IFERROR(I40/-I41,0)","v":{"v":1.7376411441949557,"d":"1.74 : 1"}},null,{"$f":"IFERROR(K40/-K41,0)","v":{"v":2.559365502623796,"d":"2.56 : 1"}},null,0.47289646724470424,{"$nulls":8},{"$f":"SETTINGS!O4","v":100},{"$nulls":10},"row"]
[null,"Kelly Criterion %:",null,null,{"$f":"IF(W43<0,0,W43)","v":{"v":0.14,"d":"14.00%   "}},null,"Profit Factor:",null,{"$f":"IFERROR(X15/X16,0)","v":{"v":1.4480342868291298,"d":"1.45"}},null,{"$f":"IFERROR((K40*L32)/(-K41*(1-L32)),\"\")","v":{"v":1.0968709296959127,"d":"1.10"}},null,-0.24251038827415203,{"$nulls":8},"kelly",{"$f":"IFERROR(ROUND(I32-((1-I32)/(R13/S13)),2),0)","v":{"v":0.14,"d":"0.1400"}},{"$nulls":9},{"$f":"AK43","v":56},{"$f":"IF((INDEX('TRADE LOG'!$E$15:$E$9733,AG43)>=0),1,0)","v":1},{"$f":"IFERROR(IF(AH43=20,AG43,0),0)","v":0},"total row",{"$f":"'TRADE LOG'!AX8","v":56}]
[null,"Position Size To Bet:",null,{"$f":"IFERROR(M2*E43,0)","v":{"v":7597.998800000001,"d":"$7,598.0"}},null,null,"Expectancy per trade:",null,{"$f":"S17","v":{"v":77.66218181818192,"d":"$77.7"}},null,{"$f":"IFERROR((K40*L32)+(K41*(1-L32)),\"\")","v":{"v":23.61349999999993,"d":"$23.6"}},null,-0.6959459617644731,{"$nulls":19},{"$f":"AG43-1","v":55},{"$f":"IF(OR(INDEX(ActionLog,AG44)=\"sell\",INDEX(ActionLog,AG44)=\"buy\"),1,0)+AH43","v":2},{"$f":"IFERROR(IF(AH44=20,AG44,0),0)","v":0},"base",0,0,0,0,0,0,0,0,0,0,0,0,0,0,0,0,0,0,0,0]
[{"$nulls":32},{"$f":"AG44-1","v":54},3,0,"row",{"$f":"AL45-1","v":37},38,39,40,41,42,43,44,45,46,47,48,49,50,51,52,53,54,{"$f":"BD45-1","v":55},{"$f":"AK43","v":56}]
[null,"     RISK-MULTIPLE",{"$nulls":4},"    TRADE EVALUATION CURVE",{"$nulls":8},"     TRADE EVALUATION",null,"Total Cum. Score:",{"$f":"SUM(Q48:S55)","v":10},{"$nulls":4},"evaluated total trades",{"$nulls":8},53,4,0,"cum",{"$f":"AK47","v":12},{"$f":"AK46+AL47","v":12},{"$f":"AL46+AM47","v":12},12,10,8,8,8,8,8,8,8,8,8,8,8,8,10,{"$f":"BB46+BC47","v":10},{"$f":"BC46+BD47","v":12}]
[null,"Ave. Win (R):",{"$f":"IFERROR(SUMIF('TRADE LOG'!U15:U9733,\">0\",'TRADE LOG'!W15:W9733)/P13,0)","v":{"v":1.077877260889376,"d":"1.08 R  "}},"R.Mul Ratio:",{"$f":"IFERROR(C47/C48,0)","v":{"v":1.7549777432961482,"d":"1.75 : 1  "}},{"$nulls":10},{"$f":"SETTINGS!M10","v":"ENTRY/EXIT"},"SCORE",{"$f":"SETTINGS!O10","v":"EMOTION"},"SCORE",null,null,"score","score",{"$f":"SUM(X48:X55)","v":21},{"$f":"SUM(Y48:Y55)","v":19},{"$nulls":7},52,5,0,"sum",{"$f":"SUM(AK48:AK63)","v":12},{"$f":"SUM(AL48:AL63)","v":0},{"$f":"SUM(AM48:AM63)","v":0},0,-2,-2,0,{"$f":"SUM(AR48:AR63)","v":0},{"$f":"SUM(AS48:AS63)","v":0},{"$f":"SUM(AT48:AT63)","v":0},{"$f":"SUM(AU48:AU63)","v":0},{"$f":"SUM(AV48:AV63)","v":0},{"$f":"SUM(AW48:AW63)","v":0},{"$f":"SUM(AX48:AX63)","v":0},{"$f":"SUM(AY48:AY63)","v":0},{"$f":"SUM(AZ48:AZ63)","v":0},{"$f":"SUM(BA48:BA63)","v":0},{"$f":"SUM(BB48:BB63)","v":2},{"$f":"SUM(BC48:BC63)","v":0},{"$f":"SUM(BD48:BD63)","v":2}]
[null,"Ave. Loss (R):",{"$f":"IFERROR(-SUMIF('TRADE LOG'!U15:U9733,\"<=0\",'TRADE LOG'!W15:W9733)/Q13,0)","v":{"v":0.6141828664248119,"d":"0.61 R  "}},"Expectancy:",{"$f":"(C47*I32)-(C48*(1-I32))","v":{"v":0.15493537326345536,"d":"0.15 R  "}},{"$nulls":10},{"$f":"IF(SETTINGS!M12=\"\",\"\",SETTINGS!M12)","v":"TOO EARLY"},{"$f":"IFERROR(COUNTIFS('TRADE LOG'!$Y$15:$Y$9733,DASHBOARD!P48)*V48,\"\")","v":-2},{"$f":"IF(SETTINGS!O12=\"\",\"\",SETTINGS!O12)","v":"FEAR"},{"$f":"IFERROR(COUNTIFS('TRADE LOG'!$Z$15:$Z$9733,DASHBOARD!R48)*W48,\"\")","v":0},null,null,{"$f":"SETTINGS!N12","v":-1},{"$f":"SETTINGS!P12","v":-1},{"$f":"IFERROR(ABS(Q48/V48),0)","v":2},{"$f":"IFERROR(ABS(S48/W48),0)","v":0},{"$nulls":7},51,6,0,{"$f":"P48","v":"TOO EARLY"},{"$f":"IFERROR(V48*IF(P48=\"\",0,COUNTIFS(ReviewRow,\">=\"&1,ReviewRow,\"<=\"&$AK$45,EntryExit,P48)),\"\")","v":-2},{"$f":"IFERROR($V48*IF($P48=\"\",0,COUNTIFS(ReviewRow,AL$45,EntryExit,$P48)),\"\")","v":0},0,0,0,0,0,0,0,0,0,{"$f":"IFERROR($V48*IF($P48=\"\",0,COUNTIFS(ReviewRow,AV$45,EntryExit,$P48)),\"\")","v":0},0,0,0,0,0,0,0,{"$f":"IFERROR($V48*IF($P48=\"\",0,COUNTIFS(ReviewRow,BD$45,EntryExit,$P48)),\"\")","v":0}]
[{"$nulls":15},{"$f":"IF(SETTINGS!M13=\"\",\"\",SETTINGS!M13)","v":"TOO LATE"},{"$f":"IFERROR(COUNTIFS('TRADE LOG'!$Y$15:$Y$9733,DASHBOARD!P49)*V49,\"\")","v":-6},{"$f":"IF(SETTINGS!O13=\"\",\"\",SETTINGS!O13)","v":"HOPE"},{"$f":"IFERROR(COUNTIFS('TRADE LOG'!$Z$15:$Z$9733,DASHBOARD!R49)*W49,\"\")","v":-5},null,null,{"$f":"SETTINGS!N13","v":-1},{"$f":"SETTINGS!P13","v":-1},6,5,{"$nulls":7},50,7,0,{"$f":"P49","v":"TOO LATE"},-3,0,0,0,-1,-1,0,0,0,0,0,0,0,0,0,0,0,0,0,0]
[null,"     RISK-MULTIPLE EVALUATION",{"$nulls":13},{"$f":"IF(SETTINGS!M14=\"\",\"\",SETTINGS!M14)","v":"NOT IN PLAN"},{"$f":"IFERROR(COUNTIFS('TRADE LOG'!$Y$15:$Y$9733,DASHBOARD!P50)*V50,\"\")","v":0},{"$f":"IF(SETTINGS!O14=\"\",\"\",SETTINGS!O14)","v":"GREED"},{"$f":"IFERROR(COUNTIFS('TRADE LOG'!$Z$15:$Z$9733,DASHBOARD!R50)*W50,\"\")","v":0},null,null,{"$f":"SETTINGS!N14","v":-1},{"$f":"SETTINGS!P14","v":-1},0,0,{"$nulls":7},49,8,0,"NOT IN PLAN",0,0,0,0,0,0,0,0,0,0,0,0,0,0,0,0,0,0,0,0]
[{"$nulls":15},{"$f":"IF(SETTINGS!M15=\"\",\"\",SETTINGS!M15)","v":"AS PLANNED"},{"$f":"IFERROR(COUNTIFS('TRADE LOG'!$Y$15:$Y$9733,DASHBOARD!P51)*V51,\"\")","v":11},{"$f":"IF(SETTINGS!O15=\"\",\"\",SETTINGS!O15)","v":"BORED"},{"$f":"IFERROR(COUNTIFS('TRADE LOG'!$Z$15:$Z$9733,DASHBOARD!R51)*W51,\"\")","v":0},null,null,{"$f":"SETTINGS!N15","v":1},{"$f":"SETTINGS!P15","v":-1},11,0,{"$nulls":7},48,9,0,"AS PLANNED",9,0,{"$f":"IFERROR($V51*IF($P51=\"\",0,COUNTIFS(ReviewRow,AM$45,EntryExit,$P51)),\"\")","v":0},0,0,0,0,0,0,0,0,0,0,0,0,0,0,1,0,1]
[{"$nulls":15},{"$f":"IF(SETTINGS!M16=\"\",\"\",SETTINGS!M16)","v":"BROKE RULES"},{"$f":"IFERROR(COUNTIFS('TRADE LOG'!$Y$15:$Y$9733,DASHBOARD!P52)*V52,\"\")","v":-2},{"$f":"IF(SETTINGS!O16=\"\",\"\",SETTINGS!O16)","v":"IMPULSE"},{"$f":"IFERROR(COUNTIFS('TRADE LOG'!$Z$15:$Z$9733,DASHBOARD!R52)*W52,\"\")","v":0},null,null,{"$f":"SETTINGS!N16","v":-1},{"$f":"SETTINGS!P16","v":-2},2,0,{"$nulls":7},47,10,0,"BROKE RULES",-1,0,0,0,0,0,-1,0,0,0,0,0,0,0,0,0,0,0,0,0]
[{"$nulls":15},{"$f":"IF(SETTINGS!M17=\"\",\"\",SETTINGS!M17)","v":""},{"$f":"IFERROR(COUNTIFS('TRADE LOG'!$Y$15:$Y$9733,DASHBOARD!P53)*V53,\"\")","v":0},{"$f":"IF(SETTINGS!O17=\"\",\"\",SETTINGS!O17)","v":"FOMO"},{"$f":"IFERROR(COUNTIFS('TRADE LOG'!$Z$15:$Z$9733,DASHBOARD!R53)*W53,\"\")","v":0},null,null,{"$f":"SETTINGS!N17","v":0},{"$f":"SETTINGS!P17","v":-1},0,0,{"$nulls":7},46,11,0,"",0,0,0,0,0,0,0,0,0,0,0,0,0,0,0,0,0,0,0,0]
[{"$nulls":15},{"$f":"IF(SETTINGS!M18=\"\",\"\",SETTINGS!M18)","v":""},{"$f":"IFERROR(COUNTIFS('TRADE LOG'!$Y$15:$Y$9733,DASHBOARD!P54)*V54,\"\")","v":0},{"$f":"IF(SETTINGS!O18=\"\",\"\",SETTINGS!O18)","v":"CONFIDENT"},{"$f":"IFERROR(COUNTIFS('TRADE LOG'!$Z$15:$Z$9733,DASHBOARD!R54)*W54,\"\")","v":14},null,null,{"$f":"SETTINGS!N18","v":0},{"$f":"SETTINGS!P18","v":1},0,14,{"$nulls":7},45,12,0,"",0,0,0,0,0,0,0,0,0,0,0,0,0,0,0,0,0,0,0,0]
[null,{"$f":"IFERROR(AN39,\"\")","v":"83% of win trades may due to early exit, under allocate or fear"},{"$nulls":13},{"$f":"IF(SETTINGS!M19=\"\",\"\",SETTINGS!M19)","v":""},{"$f":"IFERROR(COUNTIFS('TRADE LOG'!$Y$15:$Y$9733,DASHBOARD!P55)*V55,\"\")","v":0},{"$f":"IF(SETTINGS!O19=\"\",\"\",SETTINGS!O19)","v":"HYPED"},{"$f":"IFERROR(COUNTIFS('TRADE LOG'!$Z$15:$Z$9733,DASHBOARD!R55)*W55,\"\")","v":0},null,null,{"$f":"SETTINGS!N19","v":0},{"$f":"SETTINGS!P19","v":-1},0,0,{"$nulls":7},44,13,0,"",{"$f":"IFERROR(V55*IF(P55=\"\",0,COUNTIFS(ReviewRow,\">=\"&1,ReviewRow,\"<=\"&$AK$45,EntryExit,P55)),\"\")","v":0},0,0,0,0,0,0,0,0,0,0,0,0,0,0,0,0,0,0,0]
[null,{"$f":"IFERROR(AN40,\"\")","v":"79% of loss trades may due to early exit, under allocate or fear"},{"$nulls":13},{"$f":"IFERROR(\"Evaluated \"&TEXT((X47/AK43),\"0%\")&\"  of total trades\",\"\")","v":"Evaluated 38%  of total trades"},null,{"$f":"IFERROR(\"Evaluated \"&TEXT((Y47/AK43),\"0%\")&\"  of total trades\",\"\")","v":"Evaluated 34%  of total trades"},{"$nulls":5},{"$f":"IFERROR(ABS(#REF!/V56),0)","v":0},{"$f":"IFERROR(ABS(S56/W56),0)","v":0},{"$nulls":7},43,14,0,{"$f":"R48","v":"FEAR"},{"$f":"IFERROR(W48*COUNTIFS(ReviewRow,\">=\"&1,ReviewRow,\"<=\"&AK$45,Emotion,$R48),\"\")","v":0},{"$f":"IFERROR($W48*COUNTIFS(ReviewRow,AL$45,Emotion,$R48),\"\")","v":0},0,0,0,0,0,0,0,0,0,0,0,0,0,0,0,0,0,0]
[{"$nulls":28},"ChartSet",50,null,null,42,15,0,{"$f":"R49","v":"HOPE"},-2,{"$f":"IFERROR($W49*COUNTIFS(ReviewRow,AL$45,Emotion,$R49),\"\")","v":0},0,0,-1,-1,0,0,0,0,0,0,0,0,0,0,0,0,0,0]
[{"$nulls":32},41,16,0,"GREED",0,{"$f":"IFERROR($W50*COUNTIFS(ReviewRow,AL$45,Emotion,$R50),\"\")","v":0},0,0,0,0,0,0,0,0,0,0,0,0,0,0,0,0,0,0]
[null,"                                        Forex Trading Journal Copyright © 2020, rocketsheets.com. All Rights Reserved.",{"$nulls":25},"ChartSet",{"$nulls":4},40,17,0,"BORED",0,{"$f":"IFERROR($W51*COUNTIFS(ReviewRow,AL$45,Emotion,$R51),\"\")","v":0},0,0,0,0,0,0,0,0,0,0,0,0,0,0,0,0,0,0]
[{"$nulls":27},"ALL",{"$nulls":4},39,18,0,"IMPULSE",0,{"$f":"IFERROR($W52*COUNTIFS(ReviewRow,AL$45,Emotion,$R52),\"\")","v":0},0,0,0,0,0,0,0,0,0,0,0,0,0,0,0,0,0,0]
[{"$nulls":27},20,{"$nulls":4},38,19,0,"FOMO",0,{"$f":"IFERROR($W53*COUNTIFS(ReviewRow,AL$45,Emotion,$R53),\"\")","v":0},0,0,0,0,0,0,0,0,0,0,0,0,0,0,0,0,0,0]
[{"$nulls":27},50,{"$nulls":4},37,20,37,"CONFIDENT",11,{"$f":"IFERROR($W54*COUNTIFS(ReviewRow,AL$45,Emotion,$R54),\"\")","v":0},0,0,0,0,1,0,0,0,0,0,0,0,0,0,0,1,0,1]
[{"$nulls":27},100,{"$nulls":4},36,21,0,"HYPED",0,{"$f":"IFERROR($W55*COUNTIFS(ReviewRow,AL$45,Emotion,$R55),\"\")","v":0},0,0,0,0,0,0,0,0,0,0,0,0,0,0,0,0,0,0]
[{"$nulls":27},200,{"$nulls":4},35,22,0]
[{"$nulls":27},500,{"$nulls":4},34,23,0]
[{"$nulls":32},33,24,0]
[{"$nulls":32},32,25,0]
[{"$nulls":32},31,26,0]
[{"$nulls":32},{"$f":"AG68-1","v":30},27,0]
[{"$nulls":32},29,28,0]
[{"$nulls":32},28,29,0]
[{"$nulls":32},27,30,0]
[{"$nulls":32},26,31,0]
[{"$nulls":32},25,32,0]
[{"$nulls":32},24,33,0]
[{"$nulls":32},23,{"$f":"IF(OR(INDEX(ActionLog,AG76)=\"sell\",INDEX(ActionLog,AG76)=\"buy\"),1,0)+AH75","v":34},0]
[{"$nulls":32},22,35,0]
[{"$nulls":32},21,36,0]
[{"$nulls":32},20,37,0]
[{"$nulls":32},19,38,0]
[{"$nulls":32},18,39,0]
[{"$nulls":32},17,40,0]
[{"$nulls":32},16,41,0]
[{"$nulls":32},15,42,0]
[{"$nulls":32},14,43,0]
[{"$nulls":32},13,44,0]
[{"$nulls":32},12,45,0]
[{"$nulls":32},11,46,0]
[{"$nulls":32},10,47,0]
[{"$nulls":32},9,48,0]
[{"$nulls":32},8,49,0]
[{"$nulls":32},7,50,0]

{"sheet":"TRADE LOG","index":4,"n_rows":88,"n_cols":145,"rows_kept":88,"hidden":true,"merged":[[1,6,1,7],[1,8,1,9],[1,10,1,11],[3,3,3,4],[4,3,4,4],[5,3,5,4],[6,3,6,4],[7,8,7,9]]}
[null,"     TRADE LOG",{"$nulls":27},"trades",{"$f":"AE2+AE3","v":55},"pie chart",null,{"$f":"AH4+SETTINGS!W3","v":{"v":119,"d":"119.00"}},null,{"$f":"COUNT(J15:J13418)+12","v":{"v":68,"d":"68.00"}},null,null,{"$f":"VLOOKUP(L4,BU1:BV12,2,0)","v":6},null,"filter",{"$nulls":9},"Close Trade Stats",{"$nulls":7},{"v":1,"d":"100%"},{"v":1,"d":"100%"},{"$f":"DASHBOARD!AD57","v":50},null,"drawdown stats",{"$nulls":9},"JAN",1,"year",{"$f":"MIN($AO$15:$AO$9733)","v":2020},{"$nulls":7},"setup validation","ENTRY/EXIT","emotion",{"$nulls":32},"Setup stats",null,null,"Trades","Win","Loss","Win Rate","ave.win","ave.loss","RRR","breakeven",{"v":1,"d":"100%"},"profit","Loss","ave.profit","ave.loss","edge p&l ratio","edge breakven","RRR breakeven","NET PROFIT","EXP","profit","match","setup","exp","winrate","trades"]
[null,null,1,{"v":1,"d":"1.00"},"Rocketsheets",null,"           Trade",null,"               Evaluation",null,"             Date",{"$nulls":18},"Long",{"$f":"'TRADE STATISTICS'!$AY$4+'TRADE STATISTICS'!$AZ$4","v":52},{"$f":"IFERROR(AE2/$AE$1,0)","v":{"v":0.9454545454545454,"d":"95%"}},null,{"$f":"AH6+1","v":{"v":75,"d":"75.00"}},"next to last",{"$f":"COUNT(J15:J13418)+14","v":{"v":70,"d":"70.00"}},null,null,{"$f":"VLOOKUP(L5,BW2:BX4,2,0)","v":1},null,{"$f":"IF(J4=\"\",\"\",J4)","v":"Momentum"},"SETUP",{"$nulls":9},"day","trades","win","loss","Win%",{"$nulls":7},"chart axis","chart border",{"$nulls":7},"FEB",2,{"$f":"MAX($AO$15:$AO$9733)","v":2020},1,null,"profit",{"$nulls":3},"yield",null,{"$f":"IF(SETTINGS!R12=\"\",NA(),1)","v":1},{"$f":"IF(SETTINGS!M12=\"\",NA(),1)","v":1},{"$f":"IF(SETTINGS!O12=\"\",NA(),1)","v":1},{"$nulls":32},{"$f":"SETTINGS!R11","v":"NO SETUP"},1e-05,1,{"$f":"SETTINGS!AG24-SUM(DR3:DR12)","v":30},{"$f":"SETTINGS!AH24-SUM(DS3:DS12)","v":13},{"$f":"SETTINGS!AI24-SUM(DT3:DT12)","v":17},{"$f":"DS2/DR2","v":{"v":0.43333333333333335,"d":"43%"}},{"$f":"IFERROR(SUMIFS(PNLPercent,PNLPercent,\">0\",SetupLog,\"\")/DS2,0)","v":{"v":0.06296412559264303,"d":"6.30%"}},{"$f":"IFERROR(-SUMIFS(PNLPercent,PNLPercent,\"<=0\",SetupLog,\"\")/DT2,0)","v":{"v":0.02631896328762585,"d":"2.63%"}},{"$f":"IFERROR(DV2/DW2,0)","v":{"v":2.3923482435285095,"d":"2.39"}},{"$f":"IF(DT2=0,0,IF(SETTINGS!$AN$6=SETTINGS!$AI$3,EF2,EG2))","v":0.2947810567230746},{"$f":"IF(DU2=\"\",0,100%)","v":1},{"$f":"SETTINGS!AP24-SUM(EA3:EA12)","v":7733.410000000003},{"$f":"SETTINGS!AQ24-SUM(EB3:EB12)","v":-5996.149999999997},{"$f":"EA2/DS2","v":594.8776923076925},{"$f":"IFERROR(EB2/DT2,0)","v":-352.71470588235275},{"$f":"IFERROR(EC2/(-ED2),0)","v":1.6865690099865378},{"$f":"IF(DR2=0,\"\",1/(1+(EE2/1)))","v":{"v":0.3722219664869174,"d":"37%"}},{"$f":"IF(DR2=0,\"\",1/(1+(DX2/1)))","v":{"v":0.2947810567230746,"d":"29%"}},{"$f":"IF(DR2=0,\"\",EA2+EB2+DP2)","v":1737.2600100000056},{"$f":"IFERROR((DU2*EC2)-((1-DU2)*-ED2),0)","v":57.908666666666875},{"$f":"LARGE($EH$2:$EH$12,DQ2)","v":3057.6000199999994},{"$f":"MATCH(EJ2,$EH$2:$EH$12,0)","v":2},{"$f":"INDEX(SETTINGS!$R$11:$R$21,EK2)","v":"Momentum"},{"$f":"INDEX($EI$2:$EI$12,EK2)","v":509.5999999999999},{"$f":"INDEX($DU$2:$DU$12,EK2)","v":{"v":0.6666666666666666,"d":"66.7%"}},{"$f":"INDEX($DR$2:$DR$12,EK2)","v":{"v":6,"d":"6.00"}}]
[null,null,"                       Trading Journal",{"$nulls":26},"Short",{"$f":"'TRADE STATISTICS'!$BD$4+'TRADE STATISTICS'!$BE$4","v":3},{"$f":"IFERROR(AE3/$AE$1,0)","v":{"v":0.05454545454545454,"d":"5%"}},null,{"$f":"IF(AH5<AJ1,AH5,AJ1)","v":{"v":44,"d":"44.00"}},{"$nulls":4},{"$f":"INDEX(BU1:BU12,AM1)","v":"JUN"},null,{"$f":"IF(J5=\"\",\"\",J5)","v":""},"EXECUTION",{"$nulls":8},"Mon",2,{"$f":"COUNTIFS('TRADE LOG'!$AP$15:$AP$9733,AZ3,$BK$15:$BK$9733,\"<>0\")","v":13},{"$f":"COUNTIFS('TRADE LOG'!$AP$15:$AP$9733,AZ3,'TRADE LOG'!$BK$15:$BK$9733,\"1\")","v":4},{"$f":"BA3-BB3","v":9},{"$f":"IFERROR(BB3/BA3,0)","v":{"v":0.3076923076923077,"d":"31%"}},{"$nulls":3},"y","x",null,{"$f":"AX8+3","v":59},{"$f":"MAX(BG15:BG9733)*(1+BM3)","v":55356.84839999993},{"v":0.02,"d":"2%"},{"$f":"MAX(BH15:BH9733)*(1+BM3)","v":55356.84839999993},{"$nulls":6},"MAR",3,{"$f":"IFERROR(IF((BW2-1)<$BX$1,\"\",(BW2-1)),\"\")","v":""},2,1,{"$f":"LARGE('TRADE STATISTICS'!$BE$16:$BE$66,BY3)","v":4767.850009999999},{"$f":"IF(BZ3<0,\"\",BZ3)","v":4767.850009999999},{"$f":"MATCH(CA3,'TRADE STATISTICS'!$BE$16:$BE$66,0)","v":1},{"$f":"INDEX('TRADE STATISTICS'!$AJ$16:$AJ$66,CB3)","v":"AUDUSD"},{"$f":"IF(CC3=\"\",\"\",INDEX('TRADE STATISTICS'!$BK$16:$BK$66,CB3))","v":{"v":0.0462377547799344,"d":"4.6%"}},null,{"$f":"IF(SETTINGS!R13=\"\",NA(),1)","v":1},{"$f":"IF(SETTINGS!M13=\"\",NA(),1)","v":1},{"$f":"IF(SETTINGS!O13=\"\",NA(),1)","v":1},{"$nulls":32},{"$f":"SETTINGS!R12","v":"Momentum"},2e-05,2,{"$f":"COUNTIFS(SetupLog,DO3)","v":6},{"$f":"COUNTIFS(SetupLog,DO3,WL,\"w\")","v":4},{"$f":"DR3-DS3","v":2},{"$f":"IFERROR(DS3/DR3,\"\")","v":{"v":0.6666666666666666,"d":"67%"}},{"$f":"IFERROR(SUMIFS(PNLPercent,PNLPercent,\">0\",SetupLog,DO3)/DS3,0)","v":{"v":0.05512828668911629,"d":"5.5128%"}},{"$f":"IFERROR(-SUMIFS(PNLPercent,PNLPercent,\"<=0\",SetupLog,SETTINGS!R12)/DT3,0)","v":{"v":0.007436154334065622,"d":"0.74%"}},{"$f":"IFERROR(DV3/DW3,0)","v":{"v":7.413547945954964,"d":"7.41"}},{"$f":"IF(DT3=0,0,IF(SETTINGS!$AN$6=SETTINGS!$AI$3,EF3,EG3))","v":0.11885592218925627},1,{"$f":"SUMIFS(PNLwFees,PNLwFees,\">0\",SetupLog,DO3)","v":3242.8999999999996},{"$f":"SUMIFS(PNLwFees,PNLwFees,\"<=0\",SetupLog,DO3)","v":-185.3},810.7249999999999,-92.65,8.750404749055583,{"v":0.10255984502559848,"d":"10%"},{"v":0.11885592218925627,"d":"12%"},3057.6000199999994,509.5999999999999,1737.2600100000056,1,{"$f":"INDEX(SETTINGS!$R$11:$R$21,EK3)","v":"NO SETUP"},57.908666666666875,{"v":0.43333333333333335,"d":"43.3%"},{"v":30,"d":"30.00"}]
[null,null,"   THIS MONTH",{"$f":"IFERROR(IF(SheetlU14=\"xxx\",\"Invalid User\",SheetIAA6),\"\")","v":0},null,null,"     Symbol","usdchf","     Setup","Momentum","     Month","JUN",{"$nulls":21},{"$f":"COUNTA(F15:F25752)+14","v":{"v":69,"d":"69.00"}},{"$nulls":4},{"$f":"IFERROR(INDEX(BW2:BW4,AM2),\"\")","v":2020},null,"","EMOTION",{"$nulls":7},{"$f":"SUMIFS('TRADE LOG'!$BD$15:$BD$9733,PercentPandL,\">=\"&DASHBOARD!AM5,PercentPandL,\"<\"&DASHBOARD!AN5,'TRADE LOG'!$BK$15:$BK$9733,\"1\")","v":0},"Tue",3,{"$f":"COUNTIFS('TRADE LOG'!$AP$15:$AP$9733,AZ4,$BK$15:$BK$9733,\"<>0\")","v":0},{"$f":"COUNTIFS('TRADE LOG'!$AP$15:$AP$9733,AZ4,'TRADE LOG'!$BK$15:$BK$9733,\"1\")","v":0},{"$f":"BA4-BB4","v":0},{"$f":"IFERROR(BB4/BA4,0)","v":{"v":0,"d":"0%"}},null,{"$f":"IFERROR(ROUND(MAX(INDIRECT(\"$Bg$\"&$BJ$5&\":$Bg$\"&$BJ$4))*1.03,-1),1)","v":55900},"max axis",{"$f":"IFERROR(ROUNDUP(MAX(INDIRECT(\"$Bg$\"&$BJ$5&\":$BK$\"&$BJ$4))*BH1,-1),1)","v":{"v":54280,"d":"54,280.00"}},{"$f":"COUNT($AU$15:$AU$10591)","v":56},{"$f":"BI4+14","v":70},0,{"$f":"MIN(BG15:BG9733)*(1-BM4)","v":{"v":48004.947199999995,"d":"48,004.95"}},{"v":0.02,"d":"2%"},{"$f":"MIN(BH15:BH9733)*(1-BM4)","v":48004.947199999995},{"$nulls":6},"APR",4,{"$f":"IFERROR(IF((BW3-1)<$BX$1,\"\",(BW3-1)),\"\")","v":""},3,2,{"$f":"LARGE('TRADE STATISTICS'!$BE$16:$BE$66,BY4)","v":527.30004},{"$f":"IF(BZ4<0,\"\",BZ4)","v":527.30004},{"$f":"MATCH(CA4,'TRADE STATISTICS'!$BE$16:$BE$66,0)","v":4},{"$f":"INDEX('TRADE STATISTICS'!$AJ$16:$AJ$66,CB4)","v":"GBPUSD"},{"$f":"IF(CC4=\"\",\"\",INDEX('TRADE STATISTICS'!$BK$16:$BK$66,CB4))","v":{"v":0.004753504187823538,"d":"0.5%"}},null,{"$f":"IF(SETTINGS!R14=\"\",NA(),1)","v":1},{"$f":"IF(SETTINGS!M14=\"\",NA(),1)","v":1},{"$f":"IF(SETTINGS!O14=\"\",NA(),1)","v":1},{"$nulls":32},{"$f":"SETTINGS!R13","v":"Bounce"},3e-05,3,12,5,{"$f":"DR4-DS4","v":7},{"v":0.4166666666666667,"d":"42%"},{"v":0.0871329658985038,"d":"8.7133%"},{"$f":"IFERROR(-SUMIFS(PNLPercent,PNLPercent,\"<=0\",SetupLog,SETTINGS!R13)/DT4,0)","v":{"v":0.06562311031260129,"d":"6.56%"}},{"$f":"IFERROR(DV4/DW4,0)","v":{"v":1.327778666439894,"d":"1.33"}},{"$f":"IF(DT4=0,0,IF(SETTINGS!$AN$6=SETTINGS!$AI$3,EF4,EG4))","v":0.42959410807274073},1,1561.75,-2504.5299999999997,312.35,{"$f":"IFERROR(EB4/DT4,0)","v":-357.78999999999996},0.8729981273931637,{"v":0.5339033634762885,"d":"53%"},{"v":0.42959410807274073,"d":"43%"},-942.7799699999997,-78.56499999999994,419.34005,5,{"$f":"INDEX(SETTINGS!$R$11:$R$21,EK4)","v":"Swing Trade"},59.90571428571428,{"v":0.42857142857142855,"d":"42.9%"},{"v":7,"d":"7.00"}]
[null,{"$f":"\"e\"&COUNTA(F15:F832)+15","v":"e70"},"   THIS MONTH %",{"$f":"'MONTHLY REPORT'!L15","v":0},null,null,"     Type","SELL","     Execution",null,"     Year",2020,{"$nulls":18},"last log code=",{"$f":"\"F\"&COUNT(C15:C832)+15","v":"F71"},null,{"$f":"IF(AH4>64,AH4-25,20)","v":{"v":44,"d":"44.00"}},{"$nulls":6},{"$f":"IF(H4=\"\",\"\",H4)","v":"usdchf"},"SYMBOL",{"$nulls":8},"Wed",4,{"$f":"COUNTIFS('TRADE LOG'!$AP$15:$AP$9733,AZ5,$BK$15:$BK$9733,\"<>0\")","v":2},{"$f":"COUNTIFS('TRADE LOG'!$AP$15:$AP$9733,AZ5,'TRADE LOG'!$BK$15:$BK$9733,\"1\")","v":0},{"$f":"BA5-BB5","v":2},{"v":0,"d":"0%"},null,{"$f":"IFERROR(ROUND(MIN(INDIRECT(\"$Bg$\"&$BJ$5&\":$Bg$\"&$BJ$4))*1.03,-1),1)","v":50450},"min axis",{"$f":"IFERROR(ROUNDDOWN(MIN(INDIRECT(\"$Bg$\"&$BJ$5&\":$Bg$\"&$BJ$4))*BG1,-1),1)","v":48980},{"$f":"IF(BI1=\"ALL\",0,IF(BI1>=BI4,0,BI4-BI1))","v":6},{"$f":"BI5+14","v":20},"max drawdown",{"$f":"MIN(BS15:BS9733)","v":{"v":-0.040518855781178816,"d":"-4.05%"}},{"$f":"IFERROR(INDEX(BR15:BR9733,MATCH(BL5,BS15:BS9733,0))*BL5,0)","v":-2179.8800000000047},{"$nulls":7},"MAY",5,"",4,3,{"$f":"LARGE('TRADE STATISTICS'!$BE$16:$BE$66,BY5)","v":-65.68995000000002},"",{"$f":"MATCH(CA5,'TRADE STATISTICS'!$BE$16:$BE$66,0)","v":7},{"$f":"INDEX('TRADE STATISTICS'!$AJ$16:$AJ$66,CB5)","v":""},{"$f":"IF(CC5=\"\",\"\",INDEX('TRADE STATISTICS'!$BK$16:$BK$66,CB5))","v":""},null,{"$f":"IF(SETTINGS!R15=\"\",NA(),1)","v":1},{"$f":"IF(SETTINGS!M15=\"\",NA(),1)","v":1},{"$f":"IF(SETTINGS!O15=\"\",NA(),1)","v":1},{"$nulls":32},{"$f":"SETTINGS!R14","v":"Trend Follow"},4e-05,4,0,0,0,"",{"v":0,"d":"0.0000%"},{"$f":"IFERROR(-SUMIFS(PNLPercent,PNLPercent,\"<=0\",SetupLog,SETTINGS!R14)/DT5,0)","v":{"v":0,"d":"0.00%"}},0,{"$f":"IF(DT5=0,0,IF(SETTINGS!$AN$6=SETTINGS!$AI$3,EF5,EG5))","v":0},0,0,0,{"$error":"#DIV/0!"},{"$f":"IFERROR(EB5/DT5,0)","v":0},0,"","","",0,-942.7799699999997,3,{"$f":"INDEX(SETTINGS!$R$11:$R$21,EK5)","v":"Bounce"},-78.56499999999994,{"v":0.4166666666666667,"d":"41.7%"},{"v":12,"d":"12.00"}]
[null,null,"   CUMULATIVE",{"$f":"'MONTHLY REPORT'!K14","v":{"v":4271.419999999997,"d":"$4,271.4"}},{"$nulls":4},"     Emotion",{"$nulls":21},"Leverage",{"$f":"SETTINGS!O4","v":100},null,{"$f":"IF(AND(AH4<AH7,AH1>AH7),AH7,IF(AH4<AH1,AH1,AH7))","v":{"v":74,"d":"74.00"}},{"$nulls":6},{"$f":"IF(H5=\"\",\"\",H5)","v":"SELL"},"TYPE",{"$nulls":8},"Thu",5,{"$f":"COUNTIFS('TRADE LOG'!$AP$15:$AP$9733,AZ6,$BK$15:$BK$9733,\"<>0\")","v":28},{"$f":"COUNTIFS('TRADE LOG'!$AP$15:$AP$9733,AZ6,'TRADE LOG'!$BK$15:$BK$9733,\"1\")","v":15},{"$f":"BA6-BB6","v":13},{"v":0.5357142857142857,"d":"54%"},{"$nulls":6},"losing streak",{"$f":"-MIN(BQ15:BQ9733)","v":5},{"$f":"MIN(BP15:BP9833)","v":-1015.3599999999999},{"$nulls":7},"JUN",6,"",5,null,"profit",{"$nulls":3},"yield",null,{"$f":"IF(SETTINGS!R16=\"\",NA(),1)","v":1},{"$f":"IF(SETTINGS!M16=\"\",NA(),1)","v":1},{"$f":"IF(SETTINGS!O16=\"\",NA(),1)","v":1},{"$nulls":32},{"$f":"SETTINGS!R15","v":"Swing Trade"},5e-05,5,7,3,4,{"v":0.42857142857142855,"d":"43%"},{"v":0.07678816993210345,"d":"7.6788%"},{"$f":"IFERROR(-SUMIFS(PNLPercent,PNLPercent,\"<=0\",SetupLog,SETTINGS!R15)/DT6,0)","v":{"v":0.10347845020810478,"d":"10.35%"}},{"v":0.7420691919687172,"d":"0.74"},{"$f":"IF(DT6=0,0,IF(SETTINGS!$AN$6=SETTINGS!$AI$3,EF6,EG6))","v":0.5740300124760815},1,1267.05,-847.7099999999999,422.34999999999997,-211.92749999999998,1.992898514822286,{"v":0.3341242594920993,"d":"33%"},{"v":0.5740300124760815,"d":"57%"},419.34005,59.90571428571428,{"$error":"#NUM!"},{"$error":"#NUM!"},{"$f":"INDEX(SETTINGS!$R$11:$R$21,EK6)","v":{"$error":"#NUM!"}},{"$error":"#NUM!"},{"$error":"#NUM!"},{"$error":"#NUM!"}]
[null,null,"   CUMULATIVE %",{"$f":"'MONTHLY REPORT'!L14","v":{"v":0.08542839999999995,"d":"▲ 8.54%  "}},{"$nulls":26},"Account Currency",{"$f":"SETTINGS!O3","v":"USD"},null,{"$f":"COUNT(B15:B9733)+14","v":{"v":74,"d":"74.00"}},"last log",null,null,{"$f":"IF('TRADE LOG'!E2='TRADE STATISTICS'!X13,IFERROR('MONTHLY REPORT'!K15,0),\"Invalid User\")","v":0},{"$nulls":11},"row","Fri",6,{"$f":"COUNTIFS('TRADE LOG'!$AP$15:$AP$9733,AZ7,$BK$15:$BK$9733,\"<>0\")","v":12},{"$f":"COUNTIFS('TRADE LOG'!$AP$15:$AP$9733,AZ7,'TRADE LOG'!$BK$15:$BK$9733,\"1\")","v":6},{"$f":"BA7-BB7","v":6},{"v":0.5,"d":"50%"},{"$nulls":6},"winning streak",{"$f":"MAX(BQ15:BQ9733)","v":5},{"$f":"MAX(BP15:BP9833)","v":1391.7499999999998},{"$nulls":7},"JUL",7,"",6,1,{"$f":"SMALL('TRADE STATISTICS'!$BE$16:$BE$66,BY7)","v":-419.12997000000104},{"$f":"IF(BZ7>=0,\"\",BZ7)","v":-419.12997000000104},{"$f":"MATCH(CA7,'TRADE STATISTICS'!$BE$16:$BE$66,0)","v":3},{"$f":"INDEX('TRADE STATISTICS'!$AJ$16:$AJ$66,CB7)","v":"EURUSD"},{"$f":"IF(CC7=\"\",\"\",INDEX('TRADE STATISTICS'!$BK$16:$BK$66,CB7))","v":{"v":-2.1770770162758777E-3,"d":"-0.2%"}},null,{"$f":"IF(SETTINGS!R17=\"\",NA(),1)","v":1},{"$f":"IF(SETTINGS!M17=\"\",NA(),1)","v":{"$error":"#N/A"}},{"$f":"IF(SETTINGS!O17=\"\",NA(),1)","v":1},{"$nulls":32},{"$f":"SETTINGS!R16","v":"Bottom fishing"},6e-05,6,0,0,0,"",{"v":0,"d":"0.0000%"},{"$f":"IFERROR(-SUMIFS(PNLPercent,PNLPercent,\"<=0\",SetupLog,SETTINGS!R16)/DT7,0)","v":{"v":0,"d":"0.00%"}},0,{"$f":"IF(DT7=0,0,IF(SETTINGS!$AN$6=SETTINGS!$AI$3,EF7,EG7))","v":0},0,0,0,{"$error":"#DIV/0!"},0,0,{"$f":"IF(DR7=0,\"\",1/(1+(EE7/1)))","v":""},"","",0,{"$error":"#NUM!"},{"$error":"#NUM!"},{"$f":"INDEX(SETTINGS!$R$11:$R$21,EK7)","v":{"$error":"#NUM!"}},{"$error":"#NUM!"},{"$error":"#NUM!"},{"$error":"#NUM!"}]
[null,null,{"$f":"IF(((COUNTA(D15:D9733)*2)-(COUNT(J15:J9733)+COUNT(C15:C9733)))=0,\"\",\"        \"&((COUNTA(D15:D9733)*2)-(COUNT(J15:J9733)+COUNT(C15:C9733)))&\" Invalid Date Format\")","v":""},{"$nulls":5},{"$f":"\"      Last Data Update:  \"&TEXT(INDEX(C:C,AH4),\"mmm-dd-yyyy\")","v":"      Last Data Update:  Jun-01-2020"},{"$nulls":21},"Lot Units",{"$f":"SETTINGS!AB28","v":{"v":100000,"d":"100,000"}},null,{"$f":"IF(AH9>10014,10014,AH9)","v":{"v":174,"d":"174.00"}},"add row",null,null,{"$f":"SETTINGS!S3","v":{"v":0.01,"d":"1.0%"}},{"$nulls":11},{"$f":"COUNT(J15:J9832)","v":56},"Sat",7,{"$f":"COUNTIFS('TRADE LOG'!$AP$15:$AP$9733,AZ8,$BK$15:$BK$9733,\"<>0\")","v":0},{"$f":"COUNTIFS('TRADE LOG'!$AP$15:$AP$9733,AZ8,'TRADE LOG'!$BK$15:$BK$9733,\"1\")","v":0},{"$f":"BA8-BB8","v":0},{"$f":"IFERROR(BB8/BA8,0)","v":{"v":0,"d":"0%"}},{"$nulls":6},"cons. Losses",{"$f":"MIN(BM15:BM9833)","v":{"v":-1745.67,"d":"-1,745.67"}},{"$f":"-INDEX(BL15:BL9733,MATCH(BL8,BM15:BM9733,0))","v":3},{"$nulls":7},"AUG",8,"",7,2,{"$f":"SMALL('TRADE STATISTICS'!$BE$16:$BE$66,BY8)","v":-409.99998},{"$f":"IF(BZ8>=0,\"\",BZ8)","v":-409.99998},{"$f":"MATCH(CA8,'TRADE STATISTICS'!$BE$16:$BE$66,0)","v":2},{"$f":"INDEX('TRADE STATISTICS'!$AJ$16:$AJ$66,CB8)","v":"XAUUSD"},{"$f":"IF(CC8=\"\",\"\",INDEX('TRADE STATISTICS'!$BK$16:$BK$66,CB8))","v":{"v":-7.8782063821153487E-5,"d":"-0.0%"}},null,{"$f":"IF(SETTINGS!R18=\"\",NA(),1)","v":1},{"$f":"IF(SETTINGS!M18=\"\",NA(),1)","v":{"$error":"#N/A"}},{"$f":"IF(SETTINGS!O18=\"\",NA(),1)","v":1},{"$nulls":32},{"$f":"SETTINGS!R17","v":"My Setup 1"},7e-05,7,0,0,0,"",{"v":0,"d":"0.0000%"},{"$f":"IFERROR(-SUMIFS(PNLPercent,PNLPercent,\"<=0\",SetupLog,SETTINGS!R17)/DT8,0)","v":{"v":0,"d":"0.00%"}},0,{"$f":"IF(DT8=0,0,IF(SETTINGS!$AN$6=SETTINGS!$AI$3,EF8,EG8))","v":0},0,0,0,{"$error":"#DIV/0!"},0,0,{"$f":"IF(DR8=0,\"\",1/(1+(EE8/1)))","v":""},{"$f":"IF(DR8=0,\"\",1/(1+(DX8/1)))","v":""},{"$f":"IF(DR8=0,\"\",EA8+EB8+DP8)","v":""},0,{"$error":"#NUM!"},{"$error":"#NUM!"},{"$f":"INDEX(SETTINGS!$R$11:$R$21,EK8)","v":{"$error":"#NUM!"}},{"$error":"#NUM!"},{"$error":"#NUM!"},{"$error":"#NUM!"}]
[{"$nulls":30},"margin%",{"$f":"1/AF6","v":{"v":0.01,"d":"0.0100"}},"def",{"$f":"AH7+SETTINGS!W4","v":{"v":174,"d":"174.00"}},{"$nulls":16},"Sun",1,{"$f":"COUNTIFS('TRADE LOG'!$AP$15:$AP$9733,AZ9,$BK$15:$BK$9733,\"<>0\")","v":0},{"$f":"COUNTIFS('TRADE LOG'!$AP$15:$AP$9733,AZ9,'TRADE LOG'!$BK$15:$BK$9733,\"1\")","v":0},0,{"v":0,"d":"0%"},{"$nulls":6},"cons profit",{"$f":"MAX(BO15:BO9833)","v":2572.9},{"$f":"INDEX(BN15:BN9733,MATCH(BL9,BO15:BO9733,0))","v":4},{"$nulls":7},"SEP",9,null,null,3,{"$f":"SMALL('TRADE STATISTICS'!$BE$16:$BE$66,BY9)","v":-128.9099400000001},-128.9099400000001,{"$f":"MATCH(CA9,'TRADE STATISTICS'!$BE$16:$BE$66,0)","v":6},{"$f":"INDEX('TRADE STATISTICS'!$AJ$16:$AJ$66,CB9)","v":"USDCAD"},{"$f":"IF(CC9=\"\",\"\",INDEX('TRADE STATISTICS'!$BK$16:$BK$66,CB9))","v":{"v":-5.8599785539124535E-4,"d":"-0.1%"}},null,{"$f":"IF(SETTINGS!R19=\"\",NA(),1)","v":1},{"$f":"IF(SETTINGS!M19=\"\",NA(),1)","v":{"$error":"#N/A"}},{"$f":"IF(SETTINGS!O19=\"\",NA(),1)","v":1},{"$nulls":32},{"$f":"SETTINGS!R18","v":"My Setup 2"},8e-05,8,0,0,0,"",{"v":0,"d":"0.0000%"},{"$f":"IFERROR(-SUMIFS(PNLPercent,PNLPercent,\"<=0\",SetupLog,SETTINGS!R18)/DT9,0)","v":{"v":0,"d":"0.00%"}},0,{"$f":"IF(DT9=0,0,IF(SETTINGS!$AN$6=SETTINGS!$AI$3,EF9,EG9))","v":0},0,0,0,{"$error":"#DIV/0!"},0,0,"","","",0,{"$error":"#NUM!"},{"$error":"#NUM!"},{"$f":"INDEX(SETTINGS!$R$11:$R$21,EK9)","v":{"$error":"#NUM!"}},{"$error":"#NUM!"},{"$error":"#NUM!"},{"$error":"#NUM!"}]
[{"$nulls":31},{"$f":"1/SETTINGS!AC29","v":{"v":1,"d":"1.0000"}},"stock",{"$nulls":19},{"$f":"COUNTIFS('TRADE LOG'!$AP$15:$AP$9733,AZ10,$BK$15:$BK$9733,\"<>0\")","v":0},null,{"$f":"IF(AZ15=0,BA15,0)","v":50000},{"$nulls":17},"OCT",10,{"$nulls":9},{"$f":"IF(SETTINGS!R20=\"\",NA(),1)","v":1},{"$f":"IF(SETTINGS!M20=\"\",NA(),1)","v":{"$error":"#N/A"}},{"$f":"IF(SETTINGS!O20=\"\",NA(),1)","v":{"$error":"#N/A"}},{"$nulls":32},{"$f":"SETTINGS!R19","v":"My Setup 3"},9e-05,9,0,0,0,"",{"v":0,"d":"0.0000%"},{"$f":"IFERROR(-SUMIFS(PNLPercent,PNLPercent,\"<=0\",SetupLog,SETTINGS!R19)/DT10,0)","v":{"v":0,"d":"0.00%"}},0,{"$f":"IF(DT10=0,0,IF(SETTINGS!$AN$6=SETTINGS!$AI$3,EF10,EG10))","v":0},0,0,0,{"$error":"#DIV/0!"},0,0,"","","",0,{"$error":"#NUM!"},{"$error":"#NUM!"},{"$f":"INDEX(SETTINGS!$R$11:$R$21,EK10)","v":{"$error":"#NUM!"}},{"$error":"#NUM!"},{"$error":"#NUM!"},{"$error":"#NUM!"}]
[{"$nulls":30},"STOCK UNITS",{"$f":"1/SETTINGS!AC30","v":{"v":1,"d":"1.0000"}},"gold",{"$nulls":4},{"$f":"AX8-COUNT($C$15:$C$9733)","v":"00:00:00"},{"$nulls":19},"Line chart",{"$nulls":14},"NOV",11,{"$nulls":9},{"$f":"IF(SETTINGS!R21=\"\",NA(),1)","v":1},{"$f":"IF(SETTINGS!M21=\"\",NA(),1)","v":1},{"$f":"IF(SETTINGS!O21=\"\",NA(),1)","v":{"$error":"#N/A"}},{"$nulls":32},{"$f":"SETTINGS!R20","v":"My Setup 4"},1E-4,10,0,0,0,"",{"v":0,"d":"0.0000%"},{"$f":"IFERROR(-SUMIFS(PNLPercent,PNLPercent,\"<=0\",SetupLog,SETTINGS!R20)/DT11,0)","v":{"v":0,"d":"0.00%"}},0,{"$f":"IF(DT11=0,0,IF(SETTINGS!$AN$6=SETTINGS!$AI$3,EF11,EG11))","v":0},0,0,0,{"$error":"#DIV/0!"},0,0,"","","",0,{"$error":"#NUM!"},{"$error":"#NUM!"},{"$f":"INDEX(SETTINGS!$R$11:$R$21,EK11)","v":{"$error":"#NUM!"}},{"$error":"#NUM!"},{"$error":"#NUM!"},{"$error":"#NUM!"}]
[null,{"$f":"(B11+1)","v":1},{"$nulls":13},{"$f":"IF(D12=\"buy\",K12-G12,G12-K12)","v":0},{"$f":"IFERROR(E12*G12*IF(AM12=0,AE12,AM12)*IF(N12>0,(1/N12),AJ12),\"\")","v":0},{"$f":"IFERROR(E12*K12*IF(AM12=0,AE12,AM12)*IF(N12>0,(1/N12),AJ12),\"\")","v":0},{"$f":"IF(K12=\"\",\"\",IF(ISNUMBER(VALUE(RIGHT(F12,2)))=FALSE,P12/AG12,P12))","v":""},{"$f":"IF(OR(D12=\"in\",D12=\"out\"),M12,IF(J12=\"\",\"\",IF(K12=\"\",\"\",IF(M12=\"\",(P12*E12*AM12)+L12,M12+L12))))","v":""},{"$f":"IFERROR(T12/Q12,\"\")","v":""},{"$f":"IFERROR(IF(E12=\"\",\"\",(INT(J12-C12)&\"d \"&TEXT(J12-C12,\"h\"\"h \"\"m\"\"m \"\"\"))),\"\")","v":""},{"$f":"IFERROR(IF(F12=\"\",\"\",T12/(BG11*$AL$8)),\"\")","v":""},{"$nulls":6},{"$f":"IF(B12=\"\",\"\",IF(OR(D12=\"in\",D12=\"out\"),B12,IF(T12<=0,\"L\",\"W\")))","v":"W"},{"$f":"IF(RIGHT(F12,3)=\"JPY\",1000,IF(AI12=1,100000,IF(LEFT(F12,3)=\"XAU\",100,1)))","v":1},{"$f":"J12-C12","v":0},{"$f":"IF(O12<>\"\",O12,IF(RIGHT(F12,3)=\"jpy\",0.01,IF(LEN(F12)<6,0.01,IF(AND(G12>=10,G12<1000),0.01,IF(G12>=1000,0.1,0.0001)))))","v":{"v":0.01,"d":"0.010"}},{"$f":"MATCH(F12,curpairs,0)","v":{"$error":"#N/A"}},{"$f":"IFERROR(IF(AH12>0,1,0),0)","v":0},{"$f":"IF(AI12=1,$AF$9,IF(LEFT(F12,3)=\"XAU\",$AF$11,$AF$10))","v":1},null,null,{"$f":"IFERROR(IF(M12=\"\",AE12,M12/(IF(K12=\"\",\"\",P12)*E12)),0)","v":1},{"$f":"IF(C12=\"\",\"\",TEXT(C12,\"mmm\"))","v":""},{"$f":"IF(C12=\"\",\"\",VALUE(TEXT(C12,\"yyy\")))","v":""},{"$f":"WEEKDAY(AT12,1)","v":3},{"$f":"IF(COUNTIF($F12:F$15,F12)=1,B12,\"\")","v":""},{"$f":"AR11+0.00001","v":1e-05},{"$f":"IF(J12=\"\",\"\",J12+AR12)","v":""},{"$f":"IFERROR(SMALL(DateExit,B12),\"\")","v":"2020-05-26T05:48:19.864"},{"$f":"IF(AT12=\"\",\"\",MATCH(AT12,DateExit,0))","v":1},{"$f":"DATE(YEAR(J12),MONTH(J12),DAY(1))","v":"1900-01-01"},{"$nulls":3},{"$f":"INDEX($Q$15:$Q$9733,AU12)","v":0},{"$f":"INDEX($T$15:$T$9733,AU12)-BB12","v":{"v":50000,"d":"50,000.0"}},{"$f":"INDEX(Fees,AU12)","v":0},{"$f":"IF(AZ12=0,BA12,0)","v":50000},{"$f":"IFERROR(IF(AZ12=0,0,BA12+BB12),\"\")","v":0},{"$f":"IFERROR(BD12/AZ12,\"\")","v":""},{"$f":"IF(BG12=\"\",\"\",B12)","v":1},{"$f":"IFERROR(IF(AT12=\"\",NA(),BG11+IF(BD12=\"\",0,BD12)),\"\")","v":0},{"$f":"IF(AT12=\"\",\"\",BH11+BD12+BC12)","v":50000},{"$f":"IFERROR(AZ12/BH12,\"\")","v":0},null,{"$f":"IF(BC12<>0,0,IF(BD12>0,1,-1))","v":0},{"$f":"IF(BK12=1,0,BK12+BL11)","v":0},{"$f":"IFERROR(IF(AZ12=\"\",0,IF(BK12<0,BD12+BM11,0)),0)","v":0},{"$f":"IF(BK12=-1,0,BK12+BN11)","v":0},{"$f":"IFERROR(IF(AZ12=\"\",\"\",IF(BN12>0,BD12+BO11,0)),0)","v":0},{"$f":"IF(BQ12=$BL$7,BO12,IF(BQ12=-$BL$6,BM12,0))","v":0},{"$f":"IFERROR(BN12+BL12,\"\")","v":0},{"$f":"IFERROR(MAX($BG12:BG$14),\"\")","v":0},{"$f":"IFERROR((BG12-BR12)/BR12,\"\")","v":""},null,"DEC",12,{"$nulls":9},{"$f":"IF(SETTINGS!R22=\"\",NA(),1)","v":{"$error":"#N/A"}},{"$f":"IF(SETTINGS!M22=\"\",NA(),1)","v":{"$error":"#N/A"}},{"$f":"IF(SETTINGS!O22=\"\",NA(),1)","v":{"$error":"#N/A"}},{"$nulls":32},{"$f":"SETTINGS!R21","v":"My Setup 5"},1.1E-4,11,0,0,0,"",0,{"$f":"IFERROR(-SUMIFS(PNLPercent,PNLPercent,\"<=0\",SetupLog,SETTINGS!R21)/DT12,0)","v":0},0,{"$f":"IF(SETTINGS!$AN$6=SETTINGS!$AI$3,EF12,EG12)","v":""},0,0,0,{"$error":"#DIV/0!"},0,0,"","","",0,{"$error":"#NUM!"},{"$error":"#NUM!"},{"$f":"INDEX(SETTINGS!$R$11:$R$21,EK12)","v":{"$error":"#NUM!"}},{"$error":"#NUM!"},{"$error":"#NUM!"},{"$error":"#NUM!"}]
[null,"NO.","OPEN TIME","TYPE","SIZE","ITEM","ENTRY PRICE","S / L","T / P","CLOSE TIME","EXIT PRICE","TOTAL FEES","PROFIT / LOSS","LEVERAGE","PIP SIZE","pip decimals","ENTRY AMOUNT","EXIT AMOUNT","PIPS",{"$f":"\"NET PNL (\"&SETTINGS!AL1&\")\"","v":"NET PNL ($)"},"P&L %","DURATION","R-MUL.","TRADE SETUP","ENTRY/EXIT","EMOTION","    REASON FOR BUYING/SELLING","      ADDITIONAL NOTES","      ADDITIONAL NOTES","Deposit ref","units","duration","pip definition",{"$nulls":5},"CONTRACT SIZE","month","year","day","unique symbol","Helper unique","original unique date","Sorted sell","helper match","datecode",{"$nulls":3},"entry amount","profit & transfers","FEES","deposits","netprofit","% P&L",null,"Performance","Equity","allocation%",null,"tally","loss streak","loss cost","win streak","win cost","streak cost","Max streak","max drawdown","max drawdown%",{"$nulls":12},{"$f":"IF(SETTINGS!R23=\"\",NA(),1)","v":{"$error":"#N/A"}},{"$f":"IF(SETTINGS!M23=\"\",NA(),1)","v":{"$error":"#N/A"}},{"$f":"IF(SETTINGS!O23=\"\",NA(),1)","v":{"$error":"#N/A"}}]
[null,"b1sm1ll4hftj","Open Time","Type","Size","Item","Entry Price","S / L","T / P","Close Time","Exit Price","Total Fees","Profit / Loss",{"$nulls":3},"Entry Amount","Exit Amount","Pips","P&L + Fees ($)","P&L %","Duration","R-Mul.","Setup","Entry/Exit","Emotion","Reason for Buying/Selling"," Additional notes",null,"w/l","units",null,"pip definition",{"$nulls":6},"month","year",null,"unique name list","#","unique date","Sorted sell",null,"datecode",{"$nulls":3},"entry amount","profit",null,"IN/OUT","profit","% P&L","x axis",null,null,"allocation%",null,"Winloss",{"$nulls":6},"peak","drawdown",{"$nulls":12},{"$f":"IF(SETTINGS!R24=\"\",NA(),1)","v":{"$error":"#N/A"}},{"$f":"IF(SETTINGS!M24=\"\",NA(),1)","v":{"$error":"#N/A"}},{"$f":"IF(SETTINGS!O24=\"\",NA(),1)","v":{"$error":"#N/A"}}]
[null,1,"2020-05-26T05:48:19","IN",{"$nulls":5},"2020-05-26T05:48:19",null,null,{"v":50000,"d":"50,000.000"},null,null,{"$f":"IF(D15=\"buy\",K15-G15,G15-K15)","v":0},{"$f":"IFERROR(E15*G15*IF(AM15=0,AE15,AM15)*IF(N15>0,(1/N15),AJ15),\"\")","v":0},{"$f":"IFERROR(E15*K15*IF(AM15=0,AE15,AM15)*IF(N15>0,(1/N15),AJ15),\"\")","v":0},{"$f":"IF(K15=\"\",\"\",IF(ISNUMBER(VALUE(RIGHT(F15,2)))=FALSE,P15/AG15,P15))","v":""},{"$f":"IF(OR(D15=\"in\",D15=\"out\"),M15,IF(J15=\"\",\"\",IF(K15=\"\",\"\",IF(M15=\"\",(P15*E15*AM15)+L15,M15+L15))))","v":{"v":50000,"d":"50,000.00"}},{"$f":"IFERROR(T15/Q15,\"\")","v":""},{"$f":"IFERROR(IF(E15=\"\",\"\",(INT(J15-C15)&\"d \"&TEXT(J15-C15,\"h\"\"h \"\"m\"\"m \"\"\"))),\"\")","v":""},{"$f":"IFERROR(IF(F15=\"\",\"\",T15/(BG14*$AL$8)),\"\")","v":""},{"$nulls":6},{"$f":"IF(B15=\"\",\"\",IF(OR(D15=\"in\",D15=\"out\"),B15,IF(T15<=0,\"L\",\"W\")))","v":1},{"$f":"IF(RIGHT(F15,3)=\"JPY\",1000,IF(AI15=1,100000,IF(LEFT(F15,3)=\"XAU\",100,1)))","v":1},{"$f":"J15-C15","v":0},{"$f":"IF(O15<>\"\",O15,IF(RIGHT(F15,3)=\"jpy\",0.01,IF(LEN(F15)<6,0.01,IF(AND(G15>=10,G15<1000),0.01,IF(G15>=1000,0.1,0.0001)))))","v":{"v":0.01,"d":"0.010"}},{"$f":"MATCH(F15,curpairs,0)","v":{"$error":"#N/A"}},{"$f":"IFERROR(IF(AH15>0,1,0),0)","v":0},{"$f":"IF(AI15=1,$AF$9,IF(LEFT(F15,3)=\"XAU\",$AF$11,$AF$10))","v":1},null,null,{"$f":"IFERROR(IF(M15=\"\",AE15,M15/(IF(K15=\"\",\"\",P15)*E15)),0)","v":0},{"$f":"IF(C15=\"\",\"\",TEXT(C15,\"mmm\"))","v":"May"},{"$f":"IF(C15=\"\",\"\",VALUE(TEXT(C15,\"yyy\")))","v":2020},{"$f":"WEEKDAY(AT15,1)","v":3},{"$f":"IF(COUNTIF($F15:F$15,F15)=1,B15,\"\")","v":""},{"$f":"0.00001","v":1e-05},{"$f":"IF(J15=\"\",\"\",J15+AR15)","v":"2020-05-26T05:48:19.864"},{"$f":"IFERROR(SMALL(DateExit,B15),\"\")","v":"2020-05-26T05:48:19.864"},{"$f":"IF(AT15=\"\",\"\",MATCH(AT15,DateExit,0))","v":1},{"$f":"DATE(YEAR(J15),MONTH(J15),DAY(1))","v":"2020-05-01"},{"$nulls":3},{"$f":"INDEX(BuyAmount,AU15)","v":0},{"$f":"INDEX(PNLwFees,AU15)-BB15","v":{"v":50000,"d":"50,000.0"}},{"$f":"INDEX(Fees,AU15)","v":0},{"$f":"IF(AZ15<=0,BA15,0)","v":50000},{"$f":"IFERROR(IF(AZ15=0,0,BA15+BB15),\"\")","v":0},{"$f":"IFERROR(BD15/AZ15,\"\")","v":""},{"$f":"IF(BG15=\"\",\"\",B15)","v":1},{"$f":"BH15","v":{"v":50000,"d":"50,000.00"}},{"$f":"T15","v":{"v":50000,"d":"50,000.00"}},{"$f":"IFERROR(AZ15/(BH15),\"\")","v":{"v":0,"d":"0.00%"}},null,{"$f":"IF(BC15<>0,0,IF(BD15>0,1,-1))","v":0},{"$f":"IF(BK15=1,0,BK15+BL14)","v":0},{"$f":"IFERROR(IF(AZ15=\"\",0,IF(BK15<0,BD15+BM14,0)),0)","v":0},{"$f":"IF(BK15=-1,0,BK15+BN14)","v":0},{"$f":"IFERROR(IF(AZ15=\"\",\"\",IF(BN15>0,BD15+BO14,0)),0)","v":0},{"$f":"IF(BQ15=$BL$7,BO15,IF(BQ15=-$BL$6,BM15,0))","v":0},{"$f":"IFERROR(BN15+BL15,\"\")","v":0},{"$f":"IFERROR(MAX($BG$14:BG15),\"\")","v":50000},{"$f":"IFERROR((BG15-BR15)/BR15,\"\")","v":0},{"$nulls":12},{"$f":"IF(SETTINGS!R25=\"\",NA(),1)","v":{"$error":"#N/A"}},null,{"$f":"IF(SETTINGS!O25=\"\",NA(),1)","v":{"$error":"#N/A"}}]
[null,{"$f":"(B15+1)","v":2},"2020-05-27T08:48:48","BUY",{"v":5,"d":"5.00"},"AUDUSD",0.66398,0,0,"2020-05-27T08:49:59",0.66372,-37.65,{"v":-130,"d":"-130.000"},null,null,-0.000260000000000038,3319.8999999995153,3318.599999999515,{"v":-2.60000000000038,"d":"-2.6"},-167.65,{"v":-0.05049850899124205,"d":"-5.05%"},"0d 0h 1m ",{"v":-0.3353,"d":"-0.34R"},{"$nulls":6},{"$f":"IF(B16=\"\",\"\",IF(OR(D16=\"in\",D16=\"out\"),B16,IF(T16<=0,\"L\",\"W\")))","v":"L"},100000,8.2175925490446389E-4,{"v":1E-4,"d":"0.000"},82,1,0.01,null,null,99999.99999998539,"May",2020,4,{"$f":"IF(COUNTIF($F$15:F16,F16)=1,B16,\"\")","v":2},{"$f":"AR15+0.00001","v":2e-05},"2020-05-27T08:50:00.728","2020-05-27T08:50:00.728",2,"2020-05-01",{"$nulls":3},3319.8999999995153,{"v":-130,"d":"-130.0"},-37.65,{"$f":"IF(AZ16=\"\",BA16,0)","v":0},{"$f":"IFERROR(IF(AZ16=0,0,BA16+BB16),\"\")","v":-167.65},-0.05049850899124205,2,{"$f":"IFERROR(IF(AT16=\"\",NA(),BG15+IF(BD16=\"\",0,BD16)),\"\")","v":49832.35},{"$f":"IF(AT16=\"\",\"\",BH15+BD16+BC16)","v":49832.35},{"$f":"IFERROR(AZ16/(BH16),\"\")","v":{"v":0.06662138149213344,"d":"6.66%"}},null,-1,{"$f":"IF(BK16=1,0,BK16+BL15)","v":-1},{"$f":"IFERROR(IF(AZ16=\"\",0,IF(BK16<0,BD16+BM15,0)),0)","v":-167.65},{"$f":"IF(BK16=-1,0,BK16+BN15)","v":0},{"$f":"IFERROR(IF(AZ16=\"\",\"\",IF(BN16>0,BD16+BO15,0)),0)","v":0},0,-1,{"$f":"IFERROR(MAX($BG$14:BG16),\"\")","v":50000},-0.003353000000000029,{"$nulls":12},{"$f":"IF(SETTINGS!R26=\"\",NA(),1)","v":{"$error":"#N/A"}},null,{"$f":"IF(SETTINGS!O26=\"\",NA(),1)","v":{"$error":"#N/A"}}]
[null,{"$f":"(B16+1)","v":3},"2020-05-27T11:58:33","BUY",{"v":5,"d":"5.00"},"XAUUSD",{"v":1705.84,"d":"1,705.84000"},0,0,"2020-05-27T11:58:43",{"v":1705.24,"d":"1,705.24000"},{"v":0,"d":"0.00"},{"v":-300,"d":"-300.000"},null,null,-0.599999999999909,852920.0000001292,852620.0000001293,{"v":-5.9999999999990905,"d":"-6.0"},{"v":-300,"d":"-300.00"},{"$f":"IFERROR(T17/Q17,\"\")","v":{"v":-3.5173287060914803E-4,"d":"-0.04%"}},{"$f":"IFERROR(IF(E17=\"\",\"\",(INT(J17-C17)&\"d \"&TEXT(J17-C17,\"h\"\"h \"\"m\"\"m \"\"\"))),\"\")","v":"0d 0h 0m "},{"v":-0.6020185682593736,"d":"-0.60R"},"Swing Trade","AS PLANNED","CONFIDENT",{"$nulls":3},"L",100,1.1574074596865103E-4,{"v":0.1,"d":"0.100"},{"$error":"#N/A"},0,1,null,null,100.00000000001516,"May",2020,4,{"$f":"IF(COUNTIF($F$15:F17,F17)=1,B17,\"\")","v":3},3.0000000000000004E-5,"2020-05-27T11:58:45.592","2020-05-27T11:58:45.592",3,"2020-05-01",{"$nulls":3},852920.0000001292,{"v":-300,"d":"-300.0"},0,{"$f":"IF(AZ17=\"\",BA17,0)","v":0},-300,-3.5173287060914803E-4,3,49532.35,{"$f":"IF(AT17=\"\",\"\",BH16+BD17+BC17)","v":49532.35},{"v":17.21945354904682,"d":"1721.95%"},null,-1,-2,-467.65,0,0,0,-2,{"$f":"IFERROR(MAX($BG$14:BG17),\"\")","v":50000},-0.00935300000000003]
[null,4,"2020-05-28T04:57:49","BUY",{"v":1,"d":"1.00"},"EURUSD",1.10287,0,0,"2020-05-28T07:59:36",1.10081,-7.53,{"v":-206,"d":"-206.000"},null,null,-2.0599999999999508E-3,1102.8700000000263,1100.8100000000263,{"v":-20.599999999999508,"d":"-20.6"},-213.53,{"v":-0.19361302782739118,"d":"-19.36%"},"0d 3h 1m ",{"v":-0.43109200350881793,"d":"-0.43R"},"Swing Trade","AS PLANNED","CONFIDENT",{"$nulls":3},"L",100000,0.12623842593166046,{"v":1E-4,"d":"0.000"},109,1,0.01,null,null,100000.00000000239,"May",2020,5,{"$f":"IF(COUNTIF($F$15:F18,F18)=1,B18,\"\")","v":4},4e-05,"2020-05-28T07:59:39.456","2020-05-28T07:59:39.456",4,"2020-05-01",{"$nulls":3},1102.8700000000263,{"v":-206,"d":"-206.0"},-7.53,{"$f":"IF(AZ18=0,BA18,0)","v":0},-213.53,-0.19361302782739118,4,49318.82,49318.82,{"v":0.022362051646816088,"d":"2.24%"},null,-1,-3,-681.18,0,0,0,-3,{"$f":"IFERROR(MAX($BG$14:BG18),\"\")","v":50000},-0.013623600000000007]
[null,5,"2020-05-28T04:58:19","BUY",{"v":1,"d":"1.00"},"EURUSD",{"v":1.1027,"d":"1.10270"},0,0,"2020-05-28T07:59:38",1.10081,-7.53,{"v":-189,"d":"-189.000"},null,null,-1.8899999999999473E-3,1102.700000000031,1100.8100000000309,{"v":-18.899999999999473,"d":"-18.9"},-196.53,{"v":-0.17822617212296588,"d":"-17.82%"},"0d 3h 1m ",{"v":-0.3984888527341084,"d":"-0.40R"},"Swing Trade","AS PLANNED","CONFIDENT",{"$nulls":3},"L",100000,0.12591435185458977,{"v":1E-4,"d":"0.000"},109,1,0.01,null,null,100000.0000000028,"May",2020,5,{"$f":"IF(COUNTIF($F$15:F19,F19)=1,B19,\"\")","v":""},5e-05,"2020-05-28T07:59:42.320","2020-05-28T07:59:42.320",5,"2020-05-01",{"$nulls":3},1102.700000000031,{"v":-189,"d":"-189.0"},-7.53,0,-196.53,-0.17822617212296588,5,49122.29,49122.29,{"v":0.02244805769437929,"d":"2.24%"},null,-1,-4,-877.7099999999999,0,0,0,-4,{"$f":"IFERROR(MAX($BG$14:BG19),\"\")","v":50000},-0.01755419999999998]
[null,6,"2020-05-28T08:00:37","BUY",{"v":5,"d":"5.00"},"AUDUSD",0.65983,0,0,"2020-05-28T08:01:40",0.65963,-37.65,{"v":-100,"d":"-100.000"},null,null,-1.9999999999997797E-4,3299.1500000003634,3298.1500000003634,{"v":-1.9999999999997797,"d":"-2.0"},-137.65,{"v":-0.041722868011452904,"d":"-4.17%"},"0d 0h 1m ",{"v":-0.28021902073376465,"d":"-0.28R"},"Swing Trade",{"$nulls":5},"L",100000,7.2916666249511763E-4,{"v":1E-4,"d":"0.000"},82,1,0.01,null,null,100000.00000001102,"May",2020,5,{"$f":"IF(COUNTIF($F$15:F20,F20)=1,B20,\"\")","v":""},6e-05,"2020-05-28T08:01:45.184","2020-05-28T08:01:45.184",6,"2020-05-01",{"$nulls":3},{"$f":"INDEX($Q$15:$Q$9733,AU20)","v":3299.1500000003634},{"$f":"INDEX($T$15:$T$9733,AU20)-BB20","v":{"v":-100,"d":"-100.0"}},-37.65,0,-137.65,-0.041722868011452904,6,48984.64,48984.64,{"$f":"IFERROR(AZ20/BH20,\"\")","v":0.06735070422075906},null,-1,-5,-1015.3599999999999,0,0,-1015.3599999999999,-5,{"$f":"IFERROR(MAX($BG$14:BG20),\"\")","v":50000},-0.02030720000000001]
[null,7,"2020-05-28T08:04:35","BUY",{"v":5,"d":"5.00"},"AUDUSD",0.66008,0.66039,0,"2020-05-28T08:06:10",0.66039,-37.65,{"v":155,"d":"155.000"},null,null,3.1000000000003247E-4,3300.3999999996545,3301.949999999654,{"v":3.1000000000003247,"d":"3.1"},117.35,{"v":0.03555629620652414,"d":"3.56%"},"0d 0h 1m ",{"v":0.23956489217844612,"d":"0.24R"},{"$nulls":6},"W",100000,1.0995370394084603E-3,{"v":1E-4,"d":"0.000"},82,1,0.01,null,null,99999.99999998952,"May",2020,5,{"$f":"IF(COUNTIF($F$15:F21,F21)=1,B21,\"\")","v":""},7.0000000000000007E-5,"2020-05-28T08:06:16.048","2020-05-28T08:06:16.048",7,"2020-05-01",{"$nulls":3},3300.3999999996545,{"v":155,"d":"155.0"},-37.65,0,117.35,0.03555629620652414,7,49101.99,49101.99,0.06721519840641194,null,1,0,0,1,117.35,0,1,{"$f":"IFERROR(MAX($BG$14:BG21),\"\")","v":50000},-0.01796020000000004]
[null,8,"2020-05-28T08:12:14","BUY",{"v":5,"d":"5.00"},"AUDUSD",0.66076,0,0,"2020-05-28T09:05:32",0.66145,-37.65,{"v":345,"d":"345.000"},null,null,6.8999999999996842E-4,3303.8000000001516,3307.2500000001514,{"v":6.899999999999684,"d":"6.9"},307.35,{"v":0.0930292390580501,"d":"9.30%"},"0d 0h 53m ",{"v":0.6259420443041107,"d":"0.63R"},{"$nulls":6},"W",100000,0.03701388889021473,{"v":1E-4,"d":"0.000"},82,1,0.01,null,null,100000.00000000458,"May",2020,5,{"$f":"IF(COUNTIF($F$15:F22,F22)=1,B22,\"\")","v":""},8e-05,"2020-05-28T09:05:38.912","2020-05-28T09:05:38.912",8,"2020-05-01",{"$nulls":3},3303.8000000001516,{"v":345,"d":"345.0"},-37.65,0,307.35,0.0930292390580501,8,49409.34,49409.34,0.06686590025287024,null,1,0,0,2,424.70000000000005,0,2,{"$f":"IFERROR(MAX($BG$14:BG22),\"\")","v":50000},-0.01181320000000007]
[null,9,"2020-05-28T11:20:56","BUY",{"v":5,"d":"5.00"},"AUDUSD",0.66019,0,0,"2020-05-28T11:32:43",0.65959,-37.65,{"v":-300,"d":"-300.000"},null,null,-6.0000000000004494E-4,3300.949999999753,3297.9499999997533,{"v":-6.000000000000449,"d":"-6.0"},-337.65,{"v":-0.10228873506112642,"d":"-10.23%"},"0d 0h 11m ",{"v":-0.6833728197947999,"d":"-0.68R"},null,"TOO LATE","CONFIDENT",{"$nulls":3},"L",100000,8.182870369637385E-3,{"v":1E-4,"d":"0.000"},82,1,0.01,null,null,99999.9999999925,"May",2020,5,{"$f":"IF(COUNTIF($F$15:F23,F23)=1,B23,\"\")","v":""},9e-05,"2020-05-28T11:32:50.776","2020-05-28T11:32:50.776",9,"2020-05-01",{"$nulls":3},3300.949999999753,{"v":-300,"d":"-300.0"},-37.65,0,-337.65,-0.10228873506112642,9,49071.689999999995,49071.689999999995,0.06726790946062289,null,-1,-1,-337.65,0,0,0,-1,{"$f":"IFERROR(MAX($BG$14:BG23),\"\")","v":50000},-0.0185662000000001]
[null,10,"2020-05-28T12:05:53","BUY",{"v":5,"d":"5.00"},"EURUSD",1.09973,0,0,"2020-05-28T12:27:06",1.10113,-37.65,{"v":700,"d":"700.000"},null,null,1.3999999999998458E-3,5498.650000000606,5505.650000000605,{"v":13.999999999998458,"d":"14.0"},662.35,{"v":0.12045683940602275,"d":"12.05%"},"0d 0h 21m ",{"v":1.3497599124872204,"d":"1.35R"},"Swing Trade","AS PLANNED","CONFIDENT",{"$nulls":3},"W",100000,0.01473379629169358,{"v":1E-4,"d":"0.000"},109,1,0.01,null,null,100000.00000001102,"May",2020,5,{"$f":"IF(COUNTIF($F$15:F24,F24)=1,B24,\"\")","v":""},1E-4,"2020-05-28T12:27:14.640","2020-05-28T12:27:13.504",11,"2020-05-01",{"$nulls":3},5501.150000000346,{"v":470,"d":"470.0"},-37.65,0,432.35,0.07859265789879803,10,49504.03999999999,49504.03999999999,0.11112527381604304,null,1,0,0,1,432.35,0,1,{"$f":"IFERROR(MAX($BG$14:BG24),\"\")","v":50000},-0.009919200000000128]
[null,11,"2020-05-28T12:14:13","BUY",{"v":5,"d":"5.00"},"EURUSD",1.10023,0,0,"2020-05-28T12:27:04",1.10117,-37.65,{"v":470,"d":"470.000"},null,null,9.3999999999994088E-4,5501.150000000346,5505.850000000346,{"v":9.399999999999409,"d":"9.4"},432.35,{"v":0.07859265789879803,"d":"7.86%"},"0d 0h 12m ",{"v":0.8733630628934529,"d":"0.87R"},"Swing Trade","TOO EARLY","CONFIDENT",{"$nulls":3},"W",100000,8.923611108912155E-3,{"v":1E-4,"d":"0.000"},109,1,0.01,null,null,100000.00000000629,"May",2020,5,{"$f":"IF(COUNTIF($F$15:F25,F25)=1,B25,\"\")","v":""},1.1E-4,"2020-05-28T12:27:13.504","2020-05-28T12:27:14.640",10,"2020-05-01",{"$nulls":3},5498.650000000606,{"v":700,"d":"700.0"},-37.65,0,662.35,0.12045683940602275,11,50166.38999999999,50166.38999999999,0.10960824568003812,null,1,0,0,2,1094.7,0,2,{"$f":"IFERROR(MAX($BG$14:BG25),\"\")","v":50166.38999999999},0]
[null,12,"2020-05-28T12:37:05","BUY",{"v":5,"d":"5.00"},"EURUSD",1.10075,{"v":1.1005,"d":"1.10050"},0,"2020-05-28T12:41:41",1.10117,-37.65,{"v":210,"d":"210.000"},null,null,4.2000000000008697E-4,5503.7499999988595,5505.849999998859,{"v":4.20000000000087,"d":"4.2"},172.35,{"v":0.03131501249148957,"d":"3.13%"},"0d 0h 4m ",{"v":0.3435567119738933,"d":"0.34R"},"Swing Trade",{"$nulls":5},"W",100000,3.1944444417604245E-3,{"v":1E-4,"d":"0.000"},109,1,0.01,null,null,99999.99999997929,"May",2020,5,{"$f":"IF(COUNTIF($F$15:F26,F26)=1,B26,\"\")","v":""},1.2E-4,"2020-05-28T12:41:51.368","2020-05-28T12:41:51.368",12,"2020-05-01",{"$nulls":3},5503.7499999988595,{"v":210,"d":"210.0"},-37.65,0,172.35,0.03131501249148957,12,50338.73999999999,50338.73999999999,0.1093342821055684,null,1,0,0,3,1267.05,0,3,{"$f":"IFERROR(MAX($BG$14:BG26),\"\")","v":50338.73999999999},0]
[null,13,"2020-05-28T12:42:24","SELL",{"v":5,"d":"5.00"},"EURUSD",1.10107,0,0,"2020-05-28T12:42:48",{"v":1.1009,"d":"1.10090"},-37.65,{"v":85,"d":"85.000"},null,null,1.7000000000000348E-4,5505.349999999888,5504.499999999887,{"v":1.7000000000000348,"d":"1.7"},47.35,{"v":0.008600724749561965,"d":"0.86%"},"0d 0h 0m ",{"v":0.09406274372381988,"d":"0.09R"},{"$nulls":6},"W",100000,2.7777777722803876E-4,{"v":1E-4,"d":"0.000"},109,1,0.01,null,null,99999.99999999795,"May",2020,5,{"$f":"IF(COUNTIF($F$15:F27,F27)=1,B27,\"\")","v":""},1.3000000000000002E-4,"2020-05-28T12:42:59.232","2020-05-28T12:42:59.232",13,"2020-05-01",{"$nulls":3},5505.349999999888,{"v":85,"d":"85.0"},-37.65,0,47.35,0.008600724749561965,13,50386.08999999999,50386.08999999999,0.10926329072170293,null,1,0,0,4,1314.3999999999999,0,4,{"$f":"IFERROR(MAX($BG$14:BG27),\"\")","v":50386.08999999999},0]
[null,14,"2020-05-28T12:46:31","SELL",{"v":5,"d":"5.00"},"AUDUSD",0.66165,0,0,"2020-05-28T12:55:51",0.66142,-37.65,{"v":115,"d":"115.000"},null,null,2.2999999999995246E-4,3308.2500000006835,3307.1000000006834,{"v":2.2999999999995246,"d":"2.3"},77.35,{"v":0.02338094158542553,"d":"2.34%"},"0d 0h 9m ",{"v":0.15351459103097703,"d":"0.15R"},{"$nulls":6},"W",100000,0.006481481483206153,{"v":1E-4,"d":"0.000"},82,1,0.01,null,null,100000.00000002066,"May",2020,5,{"$f":"IF(COUNTIF($F$15:F28,F28)=1,B28,\"\")","v":""},1.4000000000000001E-4,"2020-05-28T12:56:03.096","2020-05-28T12:56:03.096",14,"2020-05-01",{"$nulls":3},3308.2500000006835,{"v":115,"d":"115.0"},-37.65,0,77.35,0.02338094158542553,14,50463.43999999999,50463.43999999999,0.06555736192381424,null,1,0,0,5,1391.7499999999998,1391.7499999999998,5,{"$f":"IFERROR(MAX($BG$14:BG28),\"\")","v":50463.43999999999},0]
[null,15,"2020-05-28T13:04:55","BUY",{"v":5,"d":"5.00"},"EURUSD",1.10068,0,0,"2020-05-28T13:08:53",1.10054,-37.65,{"v":-70,"d":"-70.000"},null,null,-0.000140000000000029,5503.399999998862,5502.699999998861,{"v":-1.40000000000029,"d":"-1.4"},-107.65,{"v":-0.019560635243671597,"d":"-1.96%"},"0d 0h 3m ",{"v":-0.21332275405719472,"d":"-0.21R"},null,"TOO EARLY",{"$nulls":4},"L",100000,2.7546296259970404E-3,{"v":1E-4,"d":"0.000"},109,1,0.01,null,null,99999.99999997929,"May",2020,5,{"$f":"IF(COUNTIF($F$15:F29,F29)=1,B29,\"\")","v":""},1.5000000000000001E-4,"2020-05-28T13:09:05.960","2020-05-28T13:09:05.960",15,"2020-05-01",{"$nulls":3},5503.399999998862,{"v":-70,"d":"-70.0"},-37.65,0,-107.65,-0.019560635243671597,15,50355.789999999986,50355.789999999986,0.10929031199786288,null,-1,-1,-107.65,0,0,0,-1,{"$f":"IFERROR(MAX($BG$14:BG29),\"\")","v":50463.43999999999},-0.002133227540571976]
[null,16,"2020-05-28T13:20:35","BUY",{"v":5,"d":"5.00"},"AUDUSD",0.66093,0.66174,0,"2020-05-28T14:10:36",0.66174,-37.65,{"v":405,"d":"405.000"},null,null,8.099999999999774E-4,3304.6500000000924,3308.7000000000926,{"v":8.099999999999774,"d":"8.1"},367.35,{"v":0.11116154509554409,"d":"11.12%"},"0d 0h 50m ",{"v":0.7295089601414259,"d":"0.73R"},"Bounce",{"$nulls":5},"W",100000,0.034733796295768116,{"v":1E-4,"d":"0.000"},82,1,0.01,null,null,100000.0000000028,"May",2020,5,{"$f":"IF(COUNTIF($F$15:F30,F30)=1,B30,\"\")","v":""},0.00016,"2020-05-28T14:10:49.824","2020-05-28T13:58:23.688",17,"2020-05-01",{"$nulls":3},3308.9999999999327,{"v":-340,"d":"-340.0"},-37.65,0,-377.65,-0.11412813538833716,16,49978.139999999985,49978.139999999985,0.06620894655143096,null,-1,-2,-485.29999999999995,0,0,0,-2,{"$f":"IFERROR(MAX($BG$14:BG30),\"\")","v":50463.43999999999},-0.00961686321820318]
[null,17,"2020-05-28T13:27:23","BUY",{"v":5,"d":"5.00"},"AUDUSD",{"v":0.6618,"d":"0.66180"},0,0,"2020-05-28T13:58:09",0.66112,-37.65,{"v":-340,"d":"-340.000"},null,null,-6.8000000000001393E-4,3308.9999999999327,3305.5999999999326,{"v":-6.800000000000139,"d":"-6.8"},-377.65,{"v":-0.11412813538833716,"d":"-11.41%"},"0d 0h 30m ",{"v":-0.7556303615940891,"d":"-0.76R"},"Bounce",{"$nulls":5},"L",100000,0.021365740743931383,{"v":1E-4,"d":"0.000"},82,1,0.01,null,null,99999.99999999795,"May",2020,5,{"$f":"IF(COUNTIF($F$15:F31,F31)=1,B31,\"\")","v":""},0.00017,"2020-05-28T13:58:23.688","2020-05-28T14:08:26.280",20,"2020-05-01",{"$nulls":3},3308.150000000773,{"v":-180,"d":"-180.0"},-37.65,0,-217.65,-0.06579205900577335,17,49760.48999999998,49760.48999999998,0.06648145948725132,null,-1,-3,-702.9499999999999,0,0,0,-3,{"$f":"IFERROR(MAX($BG$14:BG31),\"\")","v":50463.43999999999},-0.01392988666646595]
[null,18,"2020-05-28T13:42:19","BUY",{"v":5,"d":"5.00"},"AUDUSD",0.66071,0.66175,0,"2020-05-28T14:10:36",0.66175,-37.65,{"v":520,"d":"520.000"},null,null,1.0399999999999299E-3,3303.5500000002226,3308.750000000223,{"v":10.399999999999299,"d":"10.4"},482.35,{"v":0.14600959573790848,"d":"14.60%"},"0d 0h 28m ",{"v":0.9693433485080234,"d":"0.97R"},"Bounce","AS PLANNED","CONFIDENT",{"$nulls":3},"W",100000,0.019641203703940846,{"v":1E-4,"d":"0.000"},82,1,0.01,null,null,100000.00000000674,"May",2020,5,{"$f":"IF(COUNTIF($F$15:F32,F32)=1,B32,\"\")","v":""},0.00018,"2020-05-28T14:10:51.552","2020-05-28T14:10:49.824",16,"2020-05-01",{"$nulls":3},3304.6500000000924,{"v":405,"d":"405.0"},-37.65,0,367.35,0.11116154509554409,18,50127.83999999998,50127.83999999998,0.06592444438060953,null,1,0,0,1,367.35,0,1,{"$f":"IFERROR(MAX($BG$14:BG32),\"\")","v":50463.43999999999},-6.6503591511003985E-3]
[null,19,"2020-05-28T14:02:00","BUY",{"v":5,"d":"5.00"},"AUDUSD",0.66123,0.66174,0,"2020-05-28T14:10:36",0.66174,-37.65,{"v":255,"d":"255.000"},null,null,5.1000000000001044E-4,3306.149999999932,3308.699999999932,{"v":5.1000000000001044,"d":"5.1"},217.35,{"v":0.06574111882401115,"d":"6.57%"},"0d 0h 8m ",{"v":0.43359139352503534,"d":"0.43R"},"Bounce",{"$nulls":5},"W",100000,0.00597222222131677,{"v":1E-4,"d":"0.000"},82,1,0.01,null,null,99999.99999999795,"May",2020,5,{"$f":"IF(COUNTIF($F$15:F33,F33)=1,B33,\"\")","v":""},0.00019,"2020-05-28T14:10:52.416","2020-05-28T14:10:51.552",18,"2020-05-01",{"$nulls":3},3303.5500000002226,{"v":520,"d":"520.0"},-37.65,0,482.35,0.14600959573790848,19,50610.18999999998,50610.18999999998,0.0652744042257147,null,1,0,0,2,849.7,0,2,{"$f":"IFERROR(MAX($BG$14:BG33),\"\")","v":50610.18999999998},0]
[null,20,"2020-05-28T14:05:50","SELL",{"v":5,"d":"5.00"},"AUDUSD",0.66163,0,0,"2020-05-28T14:08:09",0.66199,-37.65,{"v":-180,"d":"-180.000"},null,null,-3.5999999999991594E-4,3308.150000000773,3309.950000000773,{"v":-3.5999999999991594,"d":"-3.6"},-217.65,{"v":-0.06579205900577335,"d":"-6.58%"},"0d 0h 2m ",{"v":-0.4300517346407909,"d":"-0.43R"},"Bounce",{"$nulls":5},"L",100000,1.6087962940218858E-3,{"v":1E-4,"d":"0.000"},82,1,0.01,null,null,100000.00000002336,"May",2020,5,{"$f":"IF(COUNTIF($F$15:F34,F34)=1,B34,\"\")","v":""},0.0002,"2020-05-28T14:08:26.280","2020-05-28T14:10:52.416",19,"2020-05-01",{"$nulls":3},3306.149999999932,{"v":255,"d":"255.0"},-37.65,0,217.35,0.06574111882401115,20,50827.53999999998,50827.53999999998,0.06504642955374061,null,1,0,0,3,1067.05,0,3,{"$f":"IFERROR(MAX($BG$14:BG34),\"\")","v":50827.53999999998},0]
[null,21,"2020-05-28T14:17:28","BUY",{"v":10,"d":"10.00"},"EURUSD",1.10075,0,0,"2020-05-28T14:24:33",{"v":1.1003,"d":"1.10030"},{"v":-75.3,"d":"-75.30"},{"v":-450,"d":"-450.000"},null,null,-4.4999999999983942E-4,11007.500000003925,11003.000000003925,{"v":-4.499999999998394,"d":"-4.5"},{"v":-525.3,"d":"-525.30"},{"v":-0.0477220077219907,"d":"-4.77%"},"0d 0h 7m ",{"v":-1.0334948337062941,"d":"-1.03R"},"Bounce","TOO LATE","HOPE",{"$nulls":3},"L",100000,0.004918981481750961,{"v":1E-4,"d":"0.000"},109,1,0.01,null,null,100000.00000003568,"May",2020,5,{"$f":"IF(COUNTIF($F$15:F35,F35)=1,B35,\"\")","v":""},0.00021,"2020-05-28T14:24:51.144","2020-05-28T14:24:51.144",21,"2020-05-01",{"$nulls":3},11007.500000003925,{"v":-449.99999999999994,"d":"-450.0"},-75.3,0,-525.3,-0.0477220077219907,21,50302.239999999976,50302.239999999976,0.21882723314118677,null,-1,-1,-525.3,0,0,0,-1,{"$f":"IFERROR(MAX($BG$14:BG35),\"\")","v":50827.53999999998},-0.010334948337063]
[null,22,"2020-05-28T14:50:47","BUY",{"v":10,"d":"10.00"},"EURUSD",1.10144,0,0,"2020-05-28T14:59:56",1.10068,{"v":-75.3,"d":"-75.30"},{"v":-760,"d":"-760.000"},null,null,-7.5999999999987189E-4,11014.400000001855,11006.800000001856,{"v":-7.599999999998719,"d":"-7.6"},{"v":-835.3,"d":"-835.30"},{"v":-0.07583708599650088,"d":"-7.58%"},"0d 0h 9m ",{"v":-1.660562233411475,"d":"-1.66R"},"Bounce","TOO LATE","HOPE",{"$nulls":3},"L",100000,6.3541666604578495E-3,{"v":1E-4,"d":"0.000"},109,1,0.01,null,null,100000.00000001685,"May",2020,5,{"$f":"IF(COUNTIF($F$15:F36,F36)=1,B36,\"\")","v":""},0.00022,"2020-05-28T15:00:15.008","2020-05-28T15:00:15.008",22,"2020-05-01",{"$nulls":3},11014.400000001855,{"v":-760,"d":"-760.0"},-75.3,0,-835.3,-0.07583708599650088,22,49466.93999999997,49466.93999999997,0.222661842434601,null,-1,-2,-1360.6,0,0,0,-2,{"$f":"IFERROR(MAX($BG$14:BG36),\"\")","v":50827.53999999998},-0.026768952422249952]
[null,23,"2020-05-28T15:01:02","BUY",{"v":10,"d":"10.00"},"EURUSD",1.10087,1.10221,0,"2020-05-28T15:59:10",1.10221,{"v":-75.3,"d":"-75.30"},{"v":1340,"d":"1,340.000"},null,null,1.3399999999998968E-3,11008.700000000848,11022.100000000848,{"v":13.399999999998968,"d":"13.4"},{"v":1264.7,"d":"1,264.70"},{"v":0.11488186616039156,"d":"11.49%"},"0d 0h 58m ",{"v":2.5566570319490163,"d":"2.56R"},"Momentum","BROKE RULES",{"$nulls":4},"W",100000,0.0403703703705105,{"v":1E-4,"d":"0.000"},109,1,0.01,null,null,100000.0000000077,"May",2020,5,{"$f":"IF(COUNTIF($F$15:F37,F37)=1,B37,\"\")","v":""},0.00023,"2020-05-28T15:59:29.872","2020-05-28T15:56:49.736",24,"2020-05-01",{"$nulls":3},3318.2000000002236,{"v":-260,"d":"-260.0"},-37.65,0,-297.65,-0.08970224820685309,23,49169.28999999997,49169.28999999997,0.06748521282288651,null,-1,-3,-1658.25,0,0,0,-3,{"$f":"IFERROR(MAX($BG$14:BG37),\"\")","v":50827.53999999998},-0.03262502965911803]
[null,24,"2020-05-28T15:51:50","BUY",{"v":5,"d":"5.00"},"AUDUSD",0.66364,0,0,"2020-05-28T15:56:29",0.66312,-37.65,{"v":-260,"d":"-260.000"},null,null,-5.1999999999996493E-4,3318.2000000002236,3315.6000000002236,{"v":-5.199999999999649,"d":"-5.2"},-297.65,{"v":-0.08970224820685309,"d":"-8.97%"},"0d 0h 4m ",{"v":-0.6053575310930871,"d":"-0.61R"},"Bounce",{"$nulls":5},"L",100000,0.003229166664823424,{"v":1E-4,"d":"0.000"},82,1,0.01,null,null,100000.00000000674,"May",2020,5,{"$f":"IF(COUNTIF($F$15:F38,F38)=1,B38,\"\")","v":""},0.00024,"2020-05-28T15:56:49.736","2020-05-28T15:59:29.872",23,"2020-05-01",{"$nulls":3},11008.700000000848,{"v":1340,"d":"1,340.0"},-75.3,0,1264.7,0.11488186616039156,24,50433.98999999997,50433.98999999997,0.21827937864921762,null,1,0,0,1,1264.7,0,1,{"$f":"IFERROR(MAX($BG$14:BG38),\"\")","v":50827.53999999998},-0.007742849644110463]
[null,25,"2020-05-28T15:57:29","BUY",{"v":5,"d":"5.00"},"AUDUSD",0.66358,0,0,"2020-05-28T16:00:10",0.66334,-37.65,{"v":-120,"d":"-120.000"},null,null,-2.3999999999990695E-4,3317.9000000012857,3316.700000001286,{"v":-2.3999999999990695,"d":"-2.4"},-157.65,{"v":-0.04751499442416556,"d":"-4.75%"},"0d 0h 2m ",{"v":-0.3125868090151108,"d":"-0.31R"},"Bounce",{"$nulls":5},"L",100000,0.001863425932242535,{"v":1E-4,"d":"0.000"},82,1,0.01,null,null,100000.00000003877,"May",2020,5,{"$f":"IF(COUNTIF($F$15:F39,F39)=1,B39,\"\")","v":""},0.00025,"2020-05-28T16:00:31.600","2020-05-28T16:00:31.600",25,"2020-05-01",{"$nulls":3},3317.9000000012857,{"v":-120,"d":"-120.0"},-37.65,0,-157.65,-0.04751499442416556,25,50276.33999999997,50276.33999999997,0.06599326840420937,null,-1,-1,-157.65,0,0,0,-1,{"$f":"IFERROR(MAX($BG$14:BG39),\"\")","v":50827.53999999998},-0.010844514607632237]
[null,26,"2020-05-28T16:00:00","BUY",{"v":5,"d":"5.00"},"GBPUSD",1.22771,1.22831,0,"2020-05-28T16:03:01",1.22831,-37.65,{"v":300,"d":"300.000"},null,null,5.9999999999993392E-4,6138.550000000677,6141.550000000678,{"v":5.999999999999339,"d":"6.0"},262.35,{"v":0.04273810590448414,"d":"4.27%"},"0d 0h 3m ",{"v":0.5218160271809765,"d":"0.52R"},"Bounce",{"$nulls":5},"W",100000,0.002094907409627922,{"v":1E-4,"d":"0.000"},127,1,0.01,null,null,100000.00000001102,"May",2020,5,{"$f":"IF(COUNTIF($F$15:F40,F40)=1,B40,\"\")","v":26},2.6000000000000003E-4,"2020-05-28T16:03:23.464","2020-05-28T16:02:49.192",28,"2020-05-01",{"$nulls":3},5000.203199999812,{"v":-55.68,"d":"-55.7"},-37.65,0,-93.33,-0.018665241444588393,26,50183.009999999966,50183.009999999966,0.09963936399988392,null,-1,-2,-250.98000000000002,0,0,0,-2,{"$f":"IFERROR(MAX($BG$14:BG40),\"\")","v":50827.53999999998},-0.012680723875285203]
[null,27,"2020-05-28T16:01:49","BUY",{"v":5,"d":"5.00"},"AUDUSD",0.66372,0.66426,0,"2020-05-28T16:05:21",0.66426,-37.65,{"v":270,"d":"270.000"},null,null,5.3999999999998494E-4,3318.6000000000927,3321.3000000000925,{"v":5.399999999999849,"d":"5.4"},232.35,{"v":0.07001446393057117,"d":"7.00%"},"0d 0h 3m ",{"v":0.46300530797176204,"d":"0.46R"},"Bounce",{"$nulls":5},"W",100000,2.4537037024856545E-3,{"v":1E-4,"d":"0.000"},82,1,0.01,null,null,100000.0000000028,"May",2020,5,{"$f":"IF(COUNTIF($F$15:F41,F41)=1,B41,\"\")","v":""},2.7000000000000006E-4,"2020-05-28T16:05:44.328","2020-05-28T16:03:23.464",26,"2020-05-01",{"$nulls":3},6138.550000000677,{"v":300,"d":"300.0"},-37.65,0,262.35,0.04273810590448414,27,50445.359999999964,50445.359999999964,0.12168710858641273,null,1,0,0,1,262.35,0,1,{"$f":"IFERROR(MAX($BG$14:BG41),\"\")","v":50827.53999999998},-0.007519152018768073]
[null,28,"2020-05-28T16:01:55","BUY",{"v":5,"d":"5.00"},"USDJPY",{"v":107.763,"d":"107.76300"},{"v":107.751,"d":"107.75100"},0,"2020-05-28T16:02:25",{"v":107.751,"d":"107.75100"},-37.65,{"v":-55.68,"d":"-55.680"},null,null,-0.012000000000000455,5000.203199999812,4999.646399999811,{"v":-1.2000000000000455,"d":"-1.2"},-93.33,{"v":-0.018665241444588393,"d":"-1.87%"},"0d 0h 0m ",{"v":-0.1850120605740549,"d":"-0.19R"},"Bounce",{"$nulls":5},"L",1000,3.4722221607808024E-4,{"v":0.01,"d":"0.010"},147,1,0.01,null,null,927.9999999999649,"May",2020,5,{"$f":"IF(COUNTIF($F$15:F42,F42)=1,B42,\"\")","v":28},2.8000000000000008E-4,"2020-05-28T16:02:49.192","2020-05-28T16:05:44.328",27,"2020-05-01",{"$nulls":3},3318.6000000000927,{"v":270,"d":"270.0"},-37.65,0,232.35,0.07001446393057117,28,50677.70999999996,50677.70999999996,0.06548441119379891,null,1,0,0,2,494.70000000000005,0,2,{"$f":"IFERROR(MAX($BG$14:BG42),\"\")","v":50827.53999999998},-0.002947811363682294]
[null,29,"2020-05-28T16:11:54","BUY",{"v":10,"d":"10.00"},"EURUSD",1.10293,{"v":1.1035,"d":"1.10350"},0,"2020-05-28T16:16:40",1.10366,{"v":-75.3,"d":"-75.30"},{"v":730,"d":"730.000"},null,null,7.3000000000011944E-4,11029.299999998197,11036.599999998196,{"v":7.300000000001194,"d":"7.3"},{"v":654.7,"d":"654.70"},{"v":0.05936006818203395,"d":"5.94%"},"0d 0h 4m ",{"v":1.2918894717223817,"d":"1.29R"},null,"AS PLANNED","CONFIDENT",{"$nulls":3},"W",100000,0.003310185180453118,{"v":1E-4,"d":"0.000"},109,1,0.01,null,null,99999.99999998364,"May",2020,5,{"$f":"IF(COUNTIF($F$15:F43,F43)=1,B43,\"\")","v":""},2.9000000000000011E-4,"2020-05-28T16:17:05.056","2020-05-28T16:17:05.056",29,"2020-05-01",{"$nulls":3},11029.299999998197,{"v":730,"d":"730.0"},-75.3,0,654.7,0.05936006818203395,29,51332.40999999996,51332.40999999996,0.21486035820251193,null,1,0,0,3,1149.4,0,3,{"$f":"IFERROR(MAX($BG$14:BG43),\"\")","v":51332.40999999996},0]
[null,30,"2020-05-28T16:41:16","BUY",{"v":50,"d":"50.00"},"GBPUSD",1.22822,1.22858,0,"2020-05-28T16:42:58",1.22858,{"v":-376.5,"d":"-376.50"},{"v":1800,"d":"1,800.000"},null,null,3.5999999999991594E-4,61411.00000001434,61429.000000014355,{"v":3.5999999999991594,"d":"3.6"},{"v":1423.5,"d":"1,423.50"},{"v":0.023179886339575444,"d":"2.32%"},"0d 0h 1m ",{"v":2.7731018278705424,"d":"2.77R"},"Momentum","AS PLANNED","CONFIDENT",{"$nulls":3},"W",100000,1.1805555550381541E-3,{"v":1E-4,"d":"0.000"},127,1,0.01,null,null,100000.00000002336,"May",2020,5,{"$f":"IF(COUNTIF($F$15:F44,F44)=1,B44,\"\")","v":""},3.0000000000000014E-4,"2020-05-28T16:43:23.920","2020-05-28T16:43:23.920",30,"2020-05-01",{"$nulls":3},61411.00000001434,{"v":1800,"d":"1,800.0"},-376.5,0,1423.5,0.023179886339575444,30,52755.90999999996,52755.90999999996,1.1640591546997179,null,1,0,0,4,2572.9,0,4,{"$f":"IFERROR(MAX($BG$14:BG44),\"\")","v":52755.90999999996},0]
[null,31,"2020-05-28T17:07:35","BUY",{"v":20,"d":"20.00"},"EURUSD",1.10429,1.10419,0,"2020-05-28T17:08:13",1.10419,{"v":-150.6,"d":"-150.60"},{"v":-200,"d":"-200.000"},null,null,-9.9999999999988987E-5,22085.80000000243,22083.80000000243,{"v":-0.9999999999998899,"d":"-1.0"},{"v":-350.6,"d":"-350.60"},{"v":-0.015874453268614287,"d":"-1.59%"},"0d 0h 0m ",{"v":-0.6645700927156792,"d":"-0.66R"},{"$nulls":6},"L",100000,4.398148157633841E-4,{"v":1E-4,"d":"0.000"},109,1,0.01,null,null,100000.00000001102,"May",2020,5,{"$f":"IF(COUNTIF($F$15:F45,F45)=1,B45,\"\")","v":""},3.1000000000000016E-4,"2020-05-28T17:08:39.784","2020-05-28T17:08:39.784",31,"2020-05-01",{"$nulls":3},22085.80000000243,{"v":-200.00000000000003,"d":"-200.0"},-150.6,0,-350.6,-0.015874453268614287,31,52405.30999999996,52405.30999999996,0.4214420256268391,null,-1,-1,-350.6,0,0,0,-1,{"$f":"IFERROR(MAX($BG$14:BG45),\"\")","v":52755.90999999996},-0.006645700927156765]
[null,32,"2020-05-29T04:15:03","BUY",{"v":1,"d":"1.00"},"EURUSD",1.10761,1.10882,0,"2020-05-29T06:02:37",1.10882,-7.53,{"v":121,"d":"121.000"},null,null,1.2099999999999334E-3,1107.610000000061,1108.820000000061,{"v":12.099999999999334,"d":"12.1"},113.47,{"v":0.10244580673702272,"d":"10.24%"},"0d 1h 47m ",{"v":0.21652385989129744,"d":"0.22R"},{"$nulls":6},"W",100000,0.07469907407357823,{"v":1E-4,"d":"0.000"},109,1,0.01,null,null,100000.00000000552,"May",2020,6,{"$f":"IF(COUNTIF($F$15:F46,F46)=1,B46,\"\")","v":""},3.2000000000000019E-4,"2020-05-29T06:03:04.648","2020-05-29T06:03:04.648",32,"2020-05-01",{"$nulls":3},1107.610000000061,{"v":121,"d":"121.0"},-7.53,0,113.47,0.10244580673702272,32,52518.77999999996,52518.77999999996,0.0210897892144498,null,1,0,0,1,113.47,0,1,{"$f":"IFERROR(MAX($BG$14:BG46),\"\")","v":52755.90999999996},-0.004494851856408079]
[null,33,"2020-05-29T06:01:51","BUY",{"v":5,"d":"5.00"},"GBPUSD",1.23297,0,0,"2020-05-29T06:14:02",1.23236,-37.65,{"v":-305,"d":"-305.000"},null,null,-6.0999999999999943E-4,6164.850000000005,6161.800000000005,{"v":-6.099999999999994,"d":"-6.1"},-342.65,{"v":-0.05558123879737539,"d":"-5.56%"},"0d 0h 12m ",{"v":-0.6524332819612342,"d":"-0.65R"},{"$nulls":6},"L",100000,0.008460648146865424,{"v":1E-4,"d":"0.000"},127,1,0.01,null,null,100000.00000000009,"May",2020,6,{"$f":"IF(COUNTIF($F$15:F47,F47)=1,B47,\"\")","v":""},3.3000000000000022E-4,"2020-05-29T06:14:30.512","2020-05-29T06:14:30.512",33,"2020-05-01",{"$nulls":3},6164.850000000005,{"v":-305,"d":"-305.0"},-37.65,0,-342.65,-0.05558123879737539,33,52176.12999999996,52176.12999999996,0.1181546044139343,null,-1,-1,-342.65,0,0,0,-1,{"$f":"IFERROR(MAX($BG$14:BG47),\"\")","v":52755.90999999996},-0.01098985876653439]
[null,34,"2020-05-29T08:07:26","BUY",{"v":5,"d":"5.00"},"USDJPY",{"v":107.148,"d":"107.14800"},{"v":107.21,"d":"107.21000"},{"v":107.255,"d":"107.25500"},"2020-05-29T08:17:06",{"v":107.21,"d":"107.21000"},-37.65,{"v":289.15,"d":"289.150"},null,null,0.06199999999999761,4997.071645161483,4999.963145161482,{"v":6.199999999999761,"d":"6.2"},{"v":251.49999999999997,"d":"251.50"},{"v":0.0503294765132135,"d":"5.03%"},"0d 0h 9m ",{"v":0.48202118478315686,"d":"0.48R"},{"$nulls":6},"W",1000,0.00671296296059154,{"v":0.01,"d":"0.010"},147,1,0.01,null,null,932.7419354839068,"May",2020,6,{"$f":"IF(COUNTIF($F$15:F48,F48)=1,B48,\"\")","v":""},3.4000000000000024E-4,"2020-05-29T08:17:35.376","2020-05-29T08:17:35.376",34,"2020-05-01",{"$nulls":3},4997.071645161483,{"v":289.15,"d":"289.2"},-37.65,0,251.49999999999997,0.0503294765132135,34,52427.62999999996,52427.62999999996,0.0953137047232821,null,1,0,0,1,251.49999999999997,0,1,{"$f":"IFERROR(MAX($BG$14:BG48),\"\")","v":52755.90999999996},-0.006222620366135265]
[null,35,"2020-05-29T08:30:13","BUY",{"v":5,"d":"5.00"},"AUDUSD",0.66495,0.66583,0,"2020-05-29T08:54:06",0.66583,-37.65,{"v":440,"d":"440.000"},null,null,8.799999999999919E-4,3324.750000000031,3329.150000000031,{"v":8.799999999999919,"d":"8.8"},402.35,{"v":0.12101661779081022,"d":"12.10%"},"0d 0h 23m ",{"v":0.7674388485613413,"d":"0.77R"},null,"AS PLANNED","CONFIDENT",{"$nulls":3},"W",100000,0.01658564815443242,{"v":1E-4,"d":"0.000"},82,1,0.01,null,null,100000.00000000092,"May",2020,6,{"$f":"IF(COUNTIF($F$15:F49,F49)=1,B49,\"\")","v":""},3.5000000000000027E-4,"2020-05-29T08:54:36.240","2020-05-29T08:54:36.240",35,"2020-05-01",{"$nulls":3},3324.750000000031,{"v":440,"d":"440.0"},-37.65,0,402.35,0.12101661779081022,35,52829.97999999996,52829.97999999996,0.06293301644255844,null,1,0,0,2,653.85,0,2,{"$f":"IFERROR(MAX($BG$14:BG49),\"\")","v":52829.97999999996},0]
[null,36,"2020-05-29T13:50:18","BUY",{"v":50,"d":"50.00"},"USDCAD",1.37441,1.37478,0,"2020-05-29T13:51:57",1.37478,{"v":-376.5,"d":"-376.50"},{"v":1345.67,"d":"1,345.670"},null,null,3.6999999999998145E-4,49986.54877567819,50000.00547567818,{"v":3.6999999999998145,"d":"3.7"},{"v":969.1700000000001,"d":"969.17"},{"v":0.019388616012465464,"d":"1.94%"},"0d 0h 1m ",{"v":1.8345076034478924,"d":"1.83R"},null,"AS PLANNED","CONFIDENT",{"$nulls":3},"W",100000,1.1458333319751546E-3,{"v":1E-4,"d":"0.000"},140,1,0.01,null,null,72738.91891892257,"May",2020,6,{"$f":"IF(COUNTIF($F$15:F50,F50)=1,B50,\"\")","v":36},3.6000000000000029E-4,"2020-05-29T13:52:28.104","2020-05-29T13:52:28.104",36,"2020-05-01",{"$nulls":3},49986.54877567819,{"v":1345.67,"d":"1,345.7"},-376.5,0,969.1700000000001,0.019388616012465464,36,53799.14999999996,53799.14999999996,0.9291326865885098,null,1,0,0,3,1623.02,0,3,{"$f":"IFERROR(MAX($BG$14:BG50),\"\")","v":53799.14999999996},0]
[null,37,"2020-05-29T13:53:32","BUY",{"v":50,"d":"50.00"},"USDCAD",1.37475,1.37462,0,"2020-05-29T13:54:49",1.37468,{"v":-376.5,"d":"-376.50"},{"v":-254.6,"d":"-254.600"},null,null,-7.00000000000145e-05,50001.62142856107,49999.075428561075,{"v":-0.700000000000145,"d":"-0.7"},{"v":-631.1,"d":"-631.10"},{"v":-0.012621590699847062,"d":"-1.26%"},"0d 0h 1m ",{"v":-1.173066860721778,"d":"-1.17R"},{"$nulls":6},"L",100000,0.000891203701030463,{"v":1E-4,"d":"0.000"},140,1,0.01,null,null,72742.85714284208,"May",2020,6,{"$f":"IF(COUNTIF($F$15:F51,F51)=1,B51,\"\")","v":""},3.7000000000000032E-4,"2020-05-29T13:55:20.968","2020-05-29T13:55:20.968",37,"2020-05-01",{"$nulls":3},50001.62142856107,{"v":-254.60000000000002,"d":"-254.6"},-376.5,0,-631.1,-0.012621590699847062,37,53168.04999999996,53168.04999999996,0.9404448993062772,null,-1,-1,-631.1,0,0,0,-1,{"$f":"IFERROR(MAX($BG$14:BG51),\"\")","v":53799.14999999996},-0.011730668607217755]
[null,38,"2020-05-29T14:11:14","BUY",{"v":40,"d":"40.00"},"USDCAD",1.37448,1.37434,0,"2020-05-29T14:12:22",1.37434,{"v":-301.2,"d":"-301.20"},{"v":-407.47,"d":"-407.470"},null,null,-0.000140000000000029,40004.240399991715,40000.16569999172,{"v":-1.40000000000029,"d":"-1.4"},{"v":-708.6700000000001,"d":"-708.67"},{"v":-0.01771487204641803,"d":"-1.77%"},"0d 0h 1m ",{"v":-1.332886949963372,"d":"-1.33R"},{"$nulls":6},"L",100000,0.000787037039117422,{"v":1E-4,"d":"0.000"},140,1,0.01,null,null,72762.49999998494,"May",2020,6,{"$f":"IF(COUNTIF($F$15:F52,F52)=1,B52,\"\")","v":""},3.8000000000000035E-4,"2020-05-29T14:12:54.832","2020-05-29T14:12:54.832",38,"2020-05-01",{"$nulls":3},40004.240399991715,{"v":-407.4700000000001,"d":"-407.5"},-301.2,0,-708.6700000000001,-0.01771487204641803,38,52459.37999999996,52459.37999999996,0.7625755470230823,null,-1,-2,-1339.77,0,0,0,-2,{"$f":"IFERROR(MAX($BG$14:BG52),\"\")","v":53799.14999999996},-0.024903181555842386]
[null,39,"2020-05-29T14:15:39","BUY",{"v":30,"d":"30.00"},"EURUSD",1.11338,1.11332,0,"2020-05-29T14:18:11",1.11332,{"v":-225.9,"d":"-225.90"},{"v":-180,"d":"-180.000"},null,null,-5.9999999999948983E-5,33401.4000000284,33399.6000000284,{"v":-0.5999999999994898,"d":"-0.6"},{"v":-405.9,"d":"-405.90"},{"v":-0.012152185237734193,"d":"-1.22%"},"0d 0h 2m ",{"v":-0.7737415120041454,"d":"-0.77R"},{"$nulls":6},"L",100000,1.7592592630535364E-3,{"v":1E-4,"d":"0.000"},109,1,0.01,null,null,100000.00000008503,"May",2020,6,{"$f":"IF(COUNTIF($F$15:F53,F53)=1,B53,\"\")","v":""},3.9000000000000037E-4,"2020-05-29T14:18:44.696","2020-05-29T14:18:44.696",39,"2020-05-01",{"$nulls":3},33401.4000000284,{"v":-179.99999999999997,"d":"-180.0"},-225.9,0,-405.9,-0.012152185237734193,39,52053.47999999996,52053.47999999996,0.641674677658985,null,-1,-3,-1745.67,0,0,0,-3,{"$f":"IFERROR(MAX($BG$14:BG53),\"\")","v":53799.14999999996},-0.032447910422376554]
[null,40,"2020-05-29T14:20:31","BUY",{"v":40,"d":"40.00"},"USDCAD",1.37336,{"v":1.3738,"d":"1.37380"},0,"2020-05-29T14:28:06",{"v":1.3738,"d":"1.37380"},{"v":-301.2,"d":"-301.20"},{"v":1281.12,"d":"1,281.120"},null,null,4.3999999999999595E-4,39987.24916363673,40000.06036363673,{"v":4.3999999999999595,"d":"4.4"},{"v":979.9199999999998,"d":"979.92"},{"v":0.02450581173988611,"d":"2.45%"},"0d 0h 7m ",{"v":1.8825254334580526,"d":"1.88R"},{"$nulls":6},"W",100000,0.005266203705104999,{"v":1E-4,"d":"0.000"},140,1,0.01,null,null,72790.90909090976,"May",2020,6,{"$f":"IF(COUNTIF($F$15:F54,F54)=1,B54,\"\")","v":""},4.000000000000004E-4,"2020-05-29T14:28:40.560","2020-05-29T14:28:40.560",40,"2020-05-01",{"$nulls":3},39987.24916363673,{"v":1281.12,"d":"1,281.1"},-301.2,0,979.9199999999998,0.02450581173988611,40,53033.39999999996,53033.39999999996,0.7540012362706664,null,1,0,0,1,979.9199999999998,0,1,{"$f":"IFERROR(MAX($BG$14:BG54),\"\")","v":53799.14999999996},-0.014233496254122985]
[null,41,"2020-05-29T15:24:34","BUY",{"v":40,"d":"40.00"},"USDCAD",1.37304,1.37289,0,"2020-05-29T15:25:47",1.37289,{"v":-301.2,"d":"-301.20"},{"v":-437.03,"d":"-437.030"},null,null,-1.500000000000945E-4,40003.9780799748,39999.6077799748,{"v":-1.500000000000945,"d":"-1.5"},-738.23,{"v":-0.018453914721284766,"d":"-1.85%"},"0d 0h 1m ",{"v":-1.3920095637843333,"d":"-1.39R"},null,"TOO LATE","HOPE",{"$nulls":3},"L",100000,8.4490740846376866E-4,{"v":1E-4,"d":"0.000"},140,1,0.01,null,null,72838.33333328745,"May",2020,6,{"$f":"IF(COUNTIF($F$15:F55,F55)=1,B55,\"\")","v":""},4.1000000000000042E-4,"2020-05-29T15:26:22.424","2020-05-29T15:26:22.424",41,"2020-05-01",{"$nulls":3},40003.9780799748,{"v":-437.03000000000003,"d":"-437.0"},-301.2,0,-738.23,-0.018453914721284766,41,52295.169999999955,52295.169999999955,0.7649650642683604,null,-1,-1,-738.23,0,0,0,-1,{"$f":"IFERROR(MAX($BG$14:BG55),\"\")","v":53799.14999999996},-0.0279554602628481]
[null,42,"2020-05-29T15:31:47","BUY",{"v":30,"d":"30.00"},"EURUSD",1.11361,0,0,"2020-05-29T15:33:05",1.11346,{"v":-225.9,"d":"-225.90"},{"v":-450,"d":"-450.000"},null,null,-1.500000000000945E-4,33408.29999997895,33403.79999997895,{"v":-1.500000000000945,"d":"-1.5"},{"v":-675.9,"d":"-675.90"},{"v":-0.02023149935795673,"d":"-2.02%"},"0d 0h 1m ",{"v":-1.2924711785046317,"d":"-1.29R"},null,"TOO LATE","HOPE",{"$nulls":3},"L",100000,9.0277777781011537E-4,{"v":1E-4,"d":"0.000"},109,1,0.01,null,null,99999.999999937,"May",2020,6,{"$f":"IF(COUNTIF($F$15:F56,F56)=1,B56,\"\")","v":""},4.2000000000000045E-4,"2020-05-29T15:33:41.288","2020-05-29T15:33:41.288",42,"2020-05-01",{"$nulls":3},33408.29999997895,{"v":-450,"d":"-450.0"},-225.9,0,-675.9,-0.02023149935795673,42,51619.26999999995,51619.26999999995,0.6472059755974655,null,-1,-2,-1414.13,0,0,0,-2,{"$f":"IFERROR(MAX($BG$14:BG56),\"\")","v":53799.14999999996},-0.040518855781178816]
[null,43,"2020-05-29T15:35:14","BUY",{"v":50,"d":"50.00"},"AUDUSD",0.66582,0.66635,0,"2020-05-29T15:37:03",0.66635,{"v":-376.5,"d":"-376.50"},{"v":2650,"d":"2,650.000"},null,null,5.3000000000003045E-4,33290.99999999808,33317.49999999809,{"v":5.3000000000003045,"d":"5.3"},{"v":2273.5,"d":"2,273.50"},{"v":0.06829173049773606,"d":"6.83%"},"0d 0h 1m ",{"v":4.404362944303556,"d":"4.40R"},null,"BROKE RULES","CONFIDENT",{"$nulls":3},"W",100000,1.261574070667848E-3,{"v":1E-4,"d":"0.000"},82,1,0.01,null,null,99999.99999999425,"May",2020,6,{"$f":"IF(COUNTIF($F$15:F57,F57)=1,B57,\"\")","v":""},4.3000000000000048E-4,"2020-05-29T15:37:40.152","2020-05-29T15:37:40.152",43,"2020-05-01",{"$nulls":3},33290.99999999808,{"v":2650,"d":"2,650.0"},-376.5,0,2273.5,0.06829173049773606,43,53892.76999999995,53892.76999999995,0.6177266449655141,null,1,0,0,1,2273.5,0,1,{"$f":"IFERROR(MAX($BG$14:BG57),\"\")","v":53892.76999999995},0]
[null,44,"2020-06-01T04:28:43","BUY",5.81,"EURUSD",1.11359,0,0,"2020-06-01T04:54:28",1.11345,-43.75,{"v":-81.34,"d":"-81.340"},null,null,-0.000140000000000029,6469.957899998661,6469.14449999866,{"v":-1.40000000000029,"d":"-1.4"},-125.09,{"v":-0.01933397433699312,"d":"-1.93%"},"0d 0h 25m ",{"v":-0.23210905655805059,"d":"-0.23R"},{"$nulls":6},"L",100000,0.01788194444088731,{"v":1E-4,"d":"0.000"},109,1,0.01,null,null,99999.99999997929,"Jun",2020,2,{"$f":"IF(COUNTIF($F$15:F58,F58)=1,B58,\"\")","v":""},4.400000000000005E-4,"2020-06-01T04:55:06.016","2020-06-01T04:55:06.016",44,"2020-06-01",{"$nulls":3},6469.957899998661,{"v":-81.34,"d":"-81.3"},-43.75,0,-125.09,-0.01933397433699312,44,53767.67999999996,53767.67999999996,0.12033172902380512,null,-1,-1,-125.09,0,0,0,-1,{"$f":"IFERROR(MAX($BG$14:BG58),\"\")","v":53892.76999999995},-2.321090565580441E-3]
[null,45,"2020-06-01T04:58:38","BUY",{"v":10,"d":"10.00"},"GBPUSD",1.24098,1.24076,0,"2020-06-01T05:01:41",1.24076,{"v":-75.3,"d":"-75.30"},{"v":-220,"d":"-220.000"},null,null,-2.1999999999988695E-4,12409.800000006377,12407.600000006376,{"v":-2.1999999999988695,"d":"-2.2"},{"v":-295.3,"d":"-295.30"},{"v":-0.023795709842209245,"d":"-2.38%"},"0d 0h 3m ",{"v":-0.549214695519688,"d":"-0.55R"},{"$nulls":6},"L",100000,2.118055555911269E-3,{"v":1E-4,"d":"0.000"},127,1,0.01,null,null,100000.00000005138,"Jun",2020,2,{"$f":"IF(COUNTIF($F$15:F59,F59)=1,B59,\"\")","v":""},4.5000000000000053E-4,"2020-06-01T05:02:19.880","2020-06-01T05:02:19.880",45,"2020-06-01",{"$nulls":3},12409.800000006377,{"v":-220,"d":"-220.0"},-75.3,0,-295.3,-0.023795709842209245,45,53472.379999999954,53472.379999999954,0.2320786918406547,null,-1,-2,-420.39,0,0,0,-2,{"$f":"IFERROR(MAX($BG$14:BG59),\"\")","v":53892.76999999995},-0.007800489750294887]
[null,46,"2020-06-01T05:03:30","BUY",{"v":10,"d":"10.00"},"USDJPY",{"v":107.715,"d":"107.71500"},{"v":107.699,"d":"107.69900"},0,"2020-06-01T05:09:12",{"v":107.699,"d":"107.69900"},{"v":-75.3,"d":"-75.30"},{"v":-148.56,"d":"-148.560"},null,null,-0.016000000000005343,10001.337749996661,9999.852149996661,{"v":-1.6000000000005343,"d":"-1.6"},-223.86,{"v":-0.022383005713418162,"d":"-2.24%"},"0d 0h 5m ",{"v":-0.4186460374496146,"d":"-0.42R"},{"$nulls":6},"L",1000,0.003958333327318542,{"v":0.01,"d":"0.010"},147,1,0.01,null,null,928.49999999969,"Jun",2020,2,{"$f":"IF(COUNTIF($F$15:F60,F60)=1,B60,\"\")","v":""},4.6000000000000056E-4,"2020-06-01T05:09:51.744","2020-06-01T05:09:51.744",46,"2020-06-01",{"$nulls":3},10001.337749996661,{"v":-148.56,"d":"-148.6"},-75.3,0,-223.86,-0.022383005713418162,46,53248.51999999995,53248.51999999995,0.1878237695619835,null,-1,-3,-644.25,0,0,0,-3,{"$f":"IFERROR(MAX($BG$14:BG60),\"\")","v":53892.76999999995},-0.01195429368354977]
[null,47,"2020-06-01T05:25:00","BUY",{"v":10,"d":"10.00"},"GBPUSD",1.24114,1.24095,0,"2020-06-01T05:29:24",1.24095,{"v":-75.3,"d":"-75.30"},{"v":-190,"d":"-190.000"},null,null,-1.8999999999991246E-4,12411.400000005717,12409.500000005717,{"v":-1.8999999999991246,"d":"-1.9"},{"v":-265.3,"d":"-265.30"},{"v":-0.021375509612120938,"d":"-2.14%"},"0d 0h 4m ",{"v":-0.4982298099552819,"d":"-0.50R"},{"$nulls":6},"L",100000,3.055555556784384E-3,{"v":1E-4,"d":"0.000"},127,1,0.01,null,null,100000.00000004607,"Jun",2020,2,{"$f":"IF(COUNTIF($F$15:F61,F61)=1,B61,\"\")","v":""},4.7000000000000058E-4,"2020-06-01T05:30:04.608","2020-06-01T05:30:04.608",47,"2020-06-01",{"$nulls":3},12411.400000005717,{"v":-190,"d":"-190.0"},-75.3,0,-265.3,-0.021375509612120938,47,52983.21999999995,52983.21999999995,0.23425152340695277,null,-1,-4,-909.55,0,0,0,-4,{"$f":"IFERROR(MAX($BG$14:BG61),\"\")","v":53892.76999999995},-0.016877031928401596]
[null,48,"2020-06-01T05:40:25","BUY",{"v":10,"d":"10.00"},"EURUSD",1.11378,1.11369,0,"2020-06-01T05:53:06",1.11369,{"v":-75.3,"d":"-75.30"},{"v":-90,"d":"-90.000"},null,null,-8.9999999999923475E-5,11137.800000009473,11136.90000000947,{"v":-0.8999999999992347,"d":"-0.9"},{"v":-165.3,"d":"-165.30"},{"v":-0.014841351074705906,"d":"-1.48%"},"0d 0h 12m ",{"v":-0.311985568261046,"d":"-0.31R"},{"$nulls":6},"L",100000,0.008807870370219462,{"v":1E-4,"d":"0.000"},109,1,0.01,null,null,100000.00000008503,"Jun",2020,2,{"$f":"IF(COUNTIF($F$15:F62,F62)=1,B62,\"\")","v":""},4.8000000000000061E-4,"2020-06-01T05:53:47.472","2020-06-01T05:46:23.336",49,"2020-06-01",{"$nulls":3},6731.700000000132,{"v":490,"d":"490.0"},-75.3,0,414.7,0.061604052468171765,48,53397.91999999995,53397.91999999995,0.1260667082163526,null,1,0,0,1,414.7,0,1,{"$f":"IFERROR(MAX($BG$14:BG62),\"\")","v":53892.76999999995},-0.00918212220303403]
[null,49,"2020-06-01T05:41:24","BUY",{"v":10,"d":"10.00"},"AUDUSD",0.67317,0.67366,0,"2020-06-01T05:45:41",0.67366,{"v":-75.3,"d":"-75.30"},{"v":490,"d":"490.000"},null,null,4.8999999999999044E-4,6731.700000000132,6736.600000000131,{"v":4.899999999999904,"d":"4.9"},{"v":414.7,"d":"414.70"},{"v":0.061604052468171765,"d":"6.16%"},"0d 0h 4m ",{"v":0.7766220107449885,"d":"0.78R"},{"$nulls":6},"W",100000,2.9745370338787325E-3,{"v":1E-4,"d":"0.000"},82,1,0.01,null,null,100000.00000000195,"Jun",2020,2,{"$f":"IF(COUNTIF($F$15:F63,F63)=1,B63,\"\")","v":""},4.9000000000000063E-4,"2020-06-01T05:46:23.336","2020-06-01T05:53:47.472",48,"2020-06-01",{"$nulls":3},11137.800000009473,{"v":-90.00000000000001,"d":"-90.0"},-75.3,0,-165.3,-0.014841351074705906,49,53232.619999999944,53232.619999999944,0.20922885253458282,null,-1,-1,-165.3,0,0,0,-1,{"$f":"IFERROR(MAX($BG$14:BG63),\"\")","v":53892.76999999995},-0.012249323981677121]
[null,50,"2020-06-01T06:00:37","BUY",{"v":10,"d":"10.00"},"XAUUSD",{"v":1738.84,"d":"1,738.84000"},0,0,"2020-06-01T06:00:50",{"v":1738.64,"d":"1,738.64000"},{"v":0,"d":"0.00"},{"v":-200,"d":"-200.000"},null,null,-0.1999999999998181,1738840.0000015812,1738640.0000015814,{"v":-1.999999999998181,"d":"-2.0"},{"v":-200,"d":"-200.00"},{"v":-1.1501920820766611E-4,"d":"-0.01%"},"0d 0h 0m ",{"v":-0.37570948039003194,"d":"-0.38R"},{"$nulls":6},"L",100,1.5046296175569296E-4,{"v":0.1,"d":"0.100"},{"$error":"#N/A"},0,1,null,null,100.00000000009095,"Jun",2020,2,{"$f":"IF(COUNTIF($F$15:F64,F64)=1,B64,\"\")","v":""},5.0000000000000066E-4,"2020-06-01T06:01:33.200","2020-06-01T06:01:33.200",50,"2020-06-01",{"$nulls":3},1738840.0000015812,{"v":-200,"d":"-200.0"},0,0,-200,-1.1501920820766611E-4,50,53032.619999999944,53032.619999999944,32.78812172586576,null,-1,-2,-365.3,0,0,0,-2,{"$f":"IFERROR(MAX($BG$14:BG64),\"\")","v":53892.76999999995},-0.01596039691409459]
[null,51,"2020-06-01T07:25:28","BUY",{"v":10,"d":"10.00"},"GBPUSD",1.23931,1.23913,0,"2020-06-01T07:31:07",1.23913,{"v":-75.3,"d":"-75.30"},{"v":-180,"d":"-180.000"},null,null,-1.7999999999984695E-4,12393.100000010536,12391.300000010538,{"v":-1.7999999999984695,"d":"-1.8"},{"v":-255.3,"d":"-255.30"},{"v":-0.020600172676713893,"d":"-2.06%"},"0d 0h 5m ",{"v":-0.48140182400944986,"d":"-0.48R"},{"$nulls":6},"L",100000,0.0039236111115315,{"v":1E-4,"d":"0.000"},127,1,0.01,null,null,100000.00000008503,"Jun",2020,2,{"$f":"IF(COUNTIF($F$15:F65,F65)=1,B65,\"\")","v":""},5.1000000000000069E-4,"2020-06-01T07:31:51.064","2020-06-01T07:29:35.928",52,"2020-06-01",{"$nulls":3},1741319.9999979846,{"v":110,"d":"110.0"},0,0,110,6.31704683803823e-05,51,53142.619999999944,53142.619999999944,32.76692041148868,null,1,0,0,1,110,0,1,{"$f":"IFERROR(MAX($BG$14:BG65),\"\")","v":53892.76999999995},-0.013919306801264983]
[null,52,"2020-06-01T07:28:15","BUY",{"v":10,"d":"10.00"},"XAUUSD",{"v":1741.32,"d":"1,741.32000"},{"v":1741.43,"d":"1,741.43000"},0,"2020-06-01T07:28:51",{"v":1741.43,"d":"1,741.43000"},{"v":0,"d":"0.00"},{"v":110,"d":"110.000"},null,null,0.11000000000012733,1741319.9999979846,1741429.9999979842,{"v":1.1000000000012733,"d":"1.1"},{"v":110,"d":"110.00"},{"v":6.31704683803823e-05,"d":"0.01%"},"0d 0h 0m ",{"v":0.2069901709776449,"d":"0.21R"},{"$nulls":6},"W",100,4.1666666948003694E-4,{"v":0.1,"d":"0.100"},{"$error":"#N/A"},0,1,null,null,99.99999999988425,"Jun",2020,2,{"$f":"IF(COUNTIF($F$15:F66,F66)=1,B66,\"\")","v":""},5.2000000000000071E-4,"2020-06-01T07:29:35.928","2020-06-01T07:31:51.064",51,"2020-06-01",{"$nulls":3},12393.100000010536,{"v":-180,"d":"-180.0"},-75.3,0,-255.3,-0.020600172676713893,52,52887.31999999994,52887.31999999994,0.23433027046956717,null,-1,-1,-255.3,0,0,0,-1,{"$f":"IFERROR(MAX($BG$14:BG66),\"\")","v":53892.76999999995},-0.018656491399495934]
[null,53,"2020-06-01T08:05:26","BUY",{"v":10,"d":"10.00"},"EURUSD",1.11318,1.11309,0,"2020-06-01T08:12:47",1.11309,{"v":-75.3,"d":"-75.30"},{"v":-90,"d":"-90.000"},null,null,-9.0000000000145519E-5,11131.799999982002,11130.899999982003,{"v":-0.9000000000014552,"d":"-0.9"},{"v":-165.3,"d":"-165.30"},{"v":-0.014849350509375596,"d":"-1.48%"},"0d 0h 7m ",{"v":-0.31255128828611506,"d":"-0.31R"},"Momentum",{"$nulls":5},"L",100000,0.005104166666569654,{"v":1E-4,"d":"0.000"},109,1,0.01,null,null,99999.99999983831,"Jun",2020,2,{"$f":"IF(COUNTIF($F$15:F67,F67)=1,B67,\"\")","v":""},5.3000000000000074E-4,"2020-06-01T08:13:32.792","2020-06-01T08:13:32.792",53,"2020-06-01",{"$nulls":3},11131.799999982002,{"v":-90.00000000000001,"d":"-90.0"},-75.3,0,-165.3,-0.014849350509375596,53,52722.01999999994,52722.01999999994,0.21114137887702358,null,-1,-2,-420.6,0,0,0,-2,{"$f":"IFERROR(MAX($BG$14:BG67),\"\")","v":53892.76999999995},-0.021723693178139027]
[null,54,"2020-06-01T08:09:07","BUY",{"v":10,"d":"10.00"},"AUDUSD",0.67216,0.67325,0,"2020-06-01T08:29:03",0.67325,{"v":-75.3,"d":"-75.30"},{"v":1090,"d":"1,090.000"},null,null,1.0900000000000354E-3,6721.599999999781,6732.499999999782,{"v":10.900000000000354,"d":"10.9"},{"v":1014.7,"d":"1,014.70"},{"v":0.15096108069507752,"d":"15.10%"},"0d 0h 19m ",{"v":1.9246227667301086,"d":"1.92R"},null,"AS PLANNED","CONFIDENT",{"$nulls":3},"W",100000,0.013842592597939074,{"v":1E-4,"d":"0.000"},82,1,0.01,null,null,99999.99999999675,"Jun",2020,2,{"$f":"IF(COUNTIF($F$15:F68,F68)=1,B68,\"\")","v":""},5.4000000000000077E-4,"2020-06-01T08:29:49.656","2020-06-01T08:23:59.520",55,"2020-06-01",{"$nulls":3},871150.0000007923,{"v":-20,"d":"-20.0"},0,0,-20,-2.2958158755646913E-5,54,52702.01999999994,52702.01999999994,16.529726944067672,null,-1,-3,-440.6,0,0,0,-3,{"$f":"IFERROR(MAX($BG$14:BG68),\"\")","v":53892.76999999995},-0.022094800471380772]
[null,55,"2020-06-01T08:16:24","BUY",{"v":5,"d":"5.00"},"XAUUSD",{"v":1742.3,"d":"1,742.30000"},{"v":1742.26,"d":"1,742.26000"},0,"2020-06-01T08:23:12",{"v":1742.26,"d":"1,742.26000"},{"v":0,"d":"0.00"},{"v":-20,"d":"-20.000"},null,null,-0.03999999999996362,871150.0000007923,871130.0000007922,{"v":-0.3999999999996362,"d":"-0.4"},{"v":-20,"d":"-20.00"},{"v":-2.2958158755646913E-5,"d":"-0.00%"},"0d 0h 6m ",{"v":-0.03794920953694,"d":"-0.04R"},"Momentum",{"$nulls":5},"L",100,4.7222222201526165E-3,{"v":0.1,"d":"0.100"},{"$error":"#N/A"},0,1,null,null,100.00000000009095,"Jun",2020,2,{"$f":"IF(COUNTIF($F$15:F69,F69)=1,B69,\"\")","v":""},5.5000000000000079E-4,"2020-06-01T08:23:59.520","2020-06-01T08:29:49.656",54,"2020-06-01",{"$nulls":3},6721.599999999781,{"v":1090,"d":"1,090.0"},-75.3,0,1014.7,0.15096108069507752,55,53716.719999999936,53716.719999999936,0.12513049940502305,null,1,0,0,1,1014.7,0,1,{"$f":"IFERROR(MAX($BG$14:BG69),\"\")","v":53892.76999999995},-3.2666719487608005E-3]
[null,56,"2020-06-01T08:20:50","BUY",{"v":10,"d":"10.00"},"AUDUSD",0.67276,0.67339,0,"2020-06-01T08:33:02",0.67339,{"v":-75.3,"d":"-75.30"},{"v":630,"d":"630.000"},null,null,6.3000000000001943E-4,6727.599999999793,6733.899999999793,{"v":6.300000000000194,"d":"6.3"},{"v":554.7,"d":"554.70"},{"v":0.08245139425649817,"d":"8.25%"},"0d 0h 12m ",{"v":1.0326393718752758,"d":"1.03R"},"Momentum","AS PLANNED","CONFIDENT",{"$nulls":3},"W",100000,0.008472222223645076,{"v":1E-4,"d":"0.000"},82,1,0.01,null,null,99999.99999999691,"Jun",2020,2,{"$f":"IF(COUNTIF($F$15:F70,F70)=1,B70,\"\")","v":""},5.6000000000000082E-4,"2020-06-01T08:33:50.384","2020-06-01T08:33:50.384",56,"2020-06-01",{"$nulls":3},6727.599999999793,{"v":630,"d":"630.0"},-75.3,0,554.7,0.08245139425649817,56,54271.41999999993,54271.41999999993,0.12396211486634773,null,1,0,0,2,1569.4,0,2,{"$f":"IFERROR(MAX($BG$14:BG70),\"\")","v":54271.41999999993},0]
[null,57,{"$nulls":13},0,0,0,"","","","","",null,"TOO LATE","HOPE",{"$nulls":3},"W",1,0,{"v":0.01,"d":"0.010"},{"$error":"#N/A"},0,1,null,null,1,"","",{"$error":"#VALUE!"},{"$f":"IF(COUNTIF($F$15:F71,F71)=1,B71,\"\")","v":""},5.7000000000000084E-4,"","","","1900-01-01",{"$nulls":3},{"$error":"#VALUE!"},{"$error":"#VALUE!"},{"$error":"#VALUE!"},{"$error":"#VALUE!"},"","","","","","",null,{"$error":"#VALUE!"},{"$error":"#VALUE!"},0,{"$error":"#VALUE!"},0,0,"",{"$f":"IFERROR(MAX($BG$14:BG71),\"\")","v":54271.41999999993},""]
[null,58,{"$nulls":13},0,0,0,"","","","","","Momentum",{"$nulls":5},"W",1,0,{"v":0.01,"d":"0.010"},{"$error":"#N/A"},0,1,null,null,1,"","",{"$error":"#VALUE!"},{"$f":"IF(COUNTIF($F$15:F72,F72)=1,B72,\"\")","v":""},5.8000000000000087E-4,"","","","1900-01-01",{"$nulls":3},{"$error":"#VALUE!"},{"$error":"#VALUE!"},{"$error":"#VALUE!"},{"$error":"#VALUE!"},"","","","","","",null,{"$error":"#VALUE!"},{"$error":"#VALUE!"},0,{"$error":"#VALUE!"},0,0,"",{"$f":"IFERROR(MAX($BG$14:BG72),\"\")","v":54271.41999999993},""]
[null,59,{"$nulls":13},0,0,0,"","","","","",{"$nulls":6},"W",1,0,{"v":0.01,"d":"0.010"},{"$error":"#N/A"},0,1,null,null,1,"","",{"$error":"#VALUE!"},{"$f":"IF(COUNTIF($F$15:F73,F73)=1,B73,\"\")","v":""},5.900000000000009E-4,"","","","1900-01-01",{"$nulls":3},{"$error":"#VALUE!"},{"$error":"#VALUE!"},{"$error":"#VALUE!"},{"$error":"#VALUE!"},"","","","","","",null,{"$error":"#VALUE!"},{"$error":"#VALUE!"},0,{"$error":"#VALUE!"},0,0,"",{"$f":"IFERROR(MAX($BG$14:BG73),\"\")","v":54271.41999999993},""]
[null,60,{"$nulls":13},0,0,0,"","","","","",{"$nulls":6},"W",1,0,{"v":0.01,"d":"0.010"},{"$error":"#N/A"},0,1,null,null,1,"","",{"$error":"#VALUE!"},{"$f":"IF(COUNTIF($F$15:F74,F74)=1,B74,\"\")","v":""},6.0000000000000092E-4,"","","","1900-01-01",{"$nulls":3},{"$error":"#VALUE!"},{"$error":"#VALUE!"},{"$error":"#VALUE!"},{"$error":"#VALUE!"},"","","","","","",null,{"$error":"#VALUE!"},{"$error":"#VALUE!"},0,{"$error":"#VALUE!"},0,0,"",{"$f":"IFERROR(MAX($BG$14:BG74),\"\")","v":54271.41999999993},""]
{"$rows_empty":13}
[{"$f":"(A87+1)","v":1}]

{"sheet":"TRADE STATISTICS","index":5,"n_rows":66,"n_cols":78,"rows_kept":66,"hidden":true,"merged":[[3,17,3,18],[4,14,4,15],[4,17,4,18],[5,14,5,15],[5,17,5,18],[6,14,6,15],[6,17,6,18],[7,14,7,15],[7,17,7,18],[8,14,8,15],[8,17,8,18]]}
[null,null,"  TRADE STATISTICS"]
[]
[null,null,"             TOP 6 TRADE SETUP",{"$nulls":10},"     STATISTICS",{"$nulls":11},{"$f":"SETTINGS!AA13","v":"REWARD-RISK RATIO"},"edge","AVE.WIN%","AVE.LOSS%","TO b.e","WIN RATE","RRR w%","Adj. RRR","EDGE",null,"REWARD-RISK RATIO",{"$nulls":4},"NET PROFIT & LOSS",null,null,"long",{"$f":"SUMIFS(PNLwFees,ActionLog,\"buy\",PNLwFees,\">0\")","v":13680.410000000003},{"$nulls":5},"LONG STATISTICS",null,"ave.profit","ave.loss",null,"SHORT STATISTICS",null,"ave.profit","ave.loss",null,"OVERALL STATISTICS",null,"ave.profit","ave.loss"]
[{"$nulls":3},"Setup","Net Profit","Trades","Win%","Expectancy",{"$nulls":7},"Total","Long","Short",{"$nulls":7},"LONG",{"$f":"BB8","v":{"v":1.85156059964273,"d":"1.85"}},{"$f":"SUMIFS(PNLPercent,ActionLog,\"buy\",WL,\"w\")/AY4","v":{"v":0.07274323706150725,"d":"7.27%"}},{"$f":"-SUMIFS(PNLPercent,ActionLog,\"buy\",WL,\"L\")/AZ4","v":{"v":0.04378545512319397,"d":"4.38%"}},{"$f":"IF($Z$3=$AJ$4,AH4,AF4)","v":{"v":0.375748275401502,"d":"37.57%"}},{"$f":"AY6","v":{"v":0.4423076923076923,"d":"44.2%"}},{"$f":"AC4/(AB4+AC4)","v":{"v":0.375748275401502,"d":"38%"}},{"$f":"1/(1+((AE4*AB4)/((1-AE4)*AC4)/1))","v":{"v":0.4314757548705455,"d":"43%"}},{"$f":"1/(1+(AA4/1))","v":{"v":0.3506851652127923,"d":"35%"}},null,"PROFIT-LOSS RATIO",{"$nulls":7},"long",{"$f":"SUMIFS(PNLwFees,ActionLog,\"buy\",PNLwFees,\"<=0\")","v":-9316.039999999997},null,{"$f":"'MONTHLY REPORT'!AD6","v":13805.110000000002},null,{"$f":"IFERROR(AU4/'Bank Transfers'!H5,0)","v":0.2761022000000001},null,{"$f":"COUNTIFS(PNLPercent,\">0\",ActionLog,\"buy\")","v":23},{"$f":"COUNTIFS(PNLPercent,\"<=0\",ActionLog,\"buy\")","v":29},{"$f":"IFERROR(AS3/AY4,0)","v":{"v":594.8004347826088,"d":"594.80"}},{"$f":"IFERROR(-AS4/AZ4,0)","v":{"v":321.2427586206896,"d":"321.24"}},null,{"$f":"COUNTIFS(PNLPercent,\">0\",ActionLog,\"sell\")","v":2},{"$f":"COUNTIFS(PNLPercent,\"<=0\",ActionLog,\"sell\")","v":1},{"$f":"IFERROR(AS5/BD4,0)","v":62.349999999999994},{"$f":"IFERROR(-AS6/BE4,0)","v":217.65},null,{"$f":"BD4+AY4","v":25},{"$f":"BE4+AZ4","v":30},{"$f":"IFERROR(AU4/BI4,0)","v":552.2044000000001},{"$f":"IFERROR(-AU6/BJ4,0)","v":317.78966666666656}]
[null,null,{"$f":"IFERROR(\"              \"&'TRADE LOG'!EL2,\"\")","v":"              Momentum"},null,{"$f":"IFERROR('TRADE LOG'!EJ2,\"\")","v":{"v":3057.6000199999994,"d":"$3,057.6"}},{"$f":"IFERROR('TRADE LOG'!EO2,\"\")","v":6},{"$f":"IFERROR('TRADE LOG'!EN2,\"\")","v":{"v":0.6666666666666666,"d":"66.7%"}},{"$f":"IFERROR('TRADE LOG'!EM2,\"\")","v":{"v":509.5999999999999,"d":"$509.6"}},{"$nulls":5},"         Ave. Profit",{"$f":"BK4","v":{"v":552.2044000000001,"d":"$552.2"}},null,{"$f":"BA4","v":{"v":594.8004347826088,"d":"$594.8"}},{"$f":"BF4","v":{"v":62.349999999999994,"d":"$62.4"}},{"$nulls":6},{"$f":"SETTINGS!O3","v":"USD"},"SHORT",{"$f":"BG8","v":{"v":0.286469101768895,"d":"0.29"}},{"$f":"SUMIFS(PNLPercent,ActionLog,\"sell\",WL,\"w\")/BD4","v":{"v":0.015990833167493747,"d":"1.60%"}},{"$f":"-SUMIFS(PNLPercent,ActionLog,\"sell\",WL,\"L\")/BE4","v":{"v":0.06579205900577335,"d":"6.58%"}},{"$f":"IF($Z$3=$AJ$4,AH5,AF5)","v":{"v":0.8044721488497226,"d":"80.45%"}},{"$f":"BD6","v":{"v":0.6666666666666666,"d":"66.7%"}},{"$f":"AC5/(AB5+AC5)","v":{"v":0.8044721488497226,"d":"80%"}},{"$f":"1/(1+((AE5*AB5)/((1-AE5)*AC5)/1))","v":{"v":0.6729012193866498,"d":"67%"}},{"$f":"1/(1+(AA5/1))","v":{"v":0.7773214285714286,"d":"78%"}},null,"PROFIT RATIO",{"$nulls":4},{"$f":"AS4+AS3","v":4364.370000000006},null,{"$f":"IFERROR(AO5/'Bank Transfers'!H5,0)","v":0.08728740000000013},"short",{"$f":"SUMIFS(PNLwFees,ActionLog,\"sell\",PNLwFees,\">0\")","v":124.69999999999999},null,"Total Profit",null,"Profit %",null,"Win Trades","Loss Trades","Ave. Profit","Ave. Loss",null,"Win Trades","Loss Trades","Ave. Profit","Ave. Loss",null,"Win Trades","Loss Trades","Ave. Profit","Ave. Loss"]
[null,null,{"$f":"IFERROR(\"              \"&'TRADE LOG'!EL3,\"\")","v":"              NO SETUP"},null,{"$f":"IFERROR('TRADE LOG'!EJ3,\"\")","v":{"v":1737.2600100000056,"d":"$1,737.3"}},{"$f":"IFERROR('TRADE LOG'!EO3,\"\")","v":30},{"$f":"IFERROR('TRADE LOG'!EN3,\"\")","v":{"v":0.43333333333333335,"d":"43.3%"}},{"$f":"IFERROR('TRADE LOG'!EM3,\"\")","v":{"v":57.908666666666875,"d":"$57.9"}},{"$nulls":5},"         Ave. Loss",{"$f":"-BL4","v":{"v":-317.78966666666656,"d":"$-317.8"}},null,{"$f":"-BB4","v":{"v":-321.2427586206896,"d":"$-321.2"}},{"$f":"-BG4","v":{"v":-217.65,"d":"$-217.7"}},{"$nulls":5},"row",{"$f":"CONCATENATE(\"L\",COUNT(D16:D66)+16)","v":"L22"},"TOTAL",{"$f":"BL8","v":{"v":1.7376411441949557,"d":"1.74"}},{"$f":"DASHBOARD!$I$37","v":{"v":0.06820304474998616,"d":"6.82%"}},{"$f":"-DASHBOARD!$I$38","v":{"v":0.04451900858594662,"d":"4.45%"}},{"v":0.3949449754368088,"d":"39.49%"},{"$f":"BI6","v":{"v":0.45454545454545453,"d":"45.5%"}},{"$f":"AC6/(AB6+AC6)","v":{"v":0.3949449754368088,"d":"39%"}},{"v":0.4392389289251258,"d":"44%"},{"$f":"1/(1+(AA6/1))","v":{"v":0.3652779700949684,"d":"37%"}},null,"Adj. PROFIT RATIO",{"$nulls":4},"Long Net P&L",null,null,"short",{"$f":"SUMIFS(PNLwFees,ActionLog,\"sell\",PNLwFees,\"<=0\")","v":-217.65},null,{"$f":"'MONTHLY REPORT'!AE6","v":-9533.689999999997},null,{"$f":"IFERROR(AU6/'Bank Transfers'!H5,0)","v":-0.19067379999999995},null,{"$f":"IFERROR(AY4/(AY4+AZ4),0)","v":{"v":0.4423076923076923,"d":"44.2%"}},{"$f":"IFERROR(AZ4/(AY4+AZ4),0)","v":{"v":0.5576923076923077,"d":"55.8%"}},{"$f":"IFERROR(BA4/(BA4+BB4),0)","v":{"v":0.6493148347872078,"d":"64.9%"}},{"$f":"IFERROR(BB4/(BA4+BB4),0)","v":{"v":0.35068516521279236,"d":"35.1%"}},null,{"$f":"IFERROR(BD4/(BD4+BE4),0)","v":{"v":0.6666666666666666,"d":"66.7%"}},{"$f":"IFERROR(BE4/(BD4+BE4),0)","v":{"v":0.3333333333333333,"d":"33.3%"}},{"$f":"IFERROR(BF4/(BF4+BG4),0)","v":{"v":0.22267857142857142,"d":"22.3%"}},{"$f":"IFERROR(BG4/(BF4+BG4),0)","v":{"v":0.7773214285714286,"d":"77.7%"}},null,{"$f":"IFERROR(BI4/(BI4+BJ4),0)","v":{"v":0.45454545454545453,"d":"45.5%"}},{"$f":"IFERROR(BJ4/(BI4+BJ4),0)","v":{"v":0.5454545454545454,"d":"54.5%"}},{"$f":"IFERROR(BK4/(BK4+BL4),0)","v":{"v":0.6347220299050317,"d":"63.5%"}},{"$f":"IFERROR(BL4/(BK4+BL4),0)","v":{"v":0.3652779700949684,"d":"36.5%"}}]
[null,null,{"$f":"IFERROR(\"              \"&'TRADE LOG'!EL4,\"\")","v":"              Swing Trade"},null,{"$f":"IFERROR('TRADE LOG'!EJ4,\"\")","v":{"v":419.34005,"d":"$419.3"}},{"$f":"IFERROR('TRADE LOG'!EO4,\"\")","v":7},{"$f":"IFERROR('TRADE LOG'!EN4,\"\")","v":{"v":0.42857142857142855,"d":"42.9%"}},{"$f":"IFERROR('TRADE LOG'!EM4,\"\")","v":{"v":59.90571428571428,"d":"$59.9"}},{"$nulls":5},"         Profit Ratio",{"$f":"BL8","v":{"v":1.7376411441949557,"d":"1.74 : 1"}},null,{"$f":"BB8","v":{"v":1.85156059964273,"d":"1.85 : 1"}},{"$f":"BG8","v":{"v":0.286469101768895,"d":"0.29 : 1"}},{"$nulls":5},{"$f":"BB9","v":{"v":83.93019230769238,"d":"83.93"}},"LONG",null,"LONG",{"$nulls":13},{"$f":"AS6+AS5","v":-92.95000000000002},null,{"$f":"IFERROR(AO7/'Bank Transfers'!H5,0)","v":-1.8590000000000004E-3},{"$nulls":3},"Total Losses",null,"Losses %",null,"Win Rate","Loss Rate","Profit Rate","Loss Rate",null,"Win Rate","Loss Rate","Profit Rate","Loss Rate",null,"Win Rate","Loss Rate","Profit Rate","Loss Rate"]
[null,null,{"$f":"IFERROR(\"              \"&'TRADE LOG'!EL5,\"\")","v":"              Bounce"},null,{"$f":"IFERROR('TRADE LOG'!EJ5,\"\")","v":{"v":-942.7799699999997,"d":"$-942.8"}},{"$f":"IFERROR('TRADE LOG'!EO5,\"\")","v":12},{"$f":"IFERROR('TRADE LOG'!EN5,\"\")","v":{"v":0.4166666666666667,"d":"41.7%"}},{"$f":"IFERROR('TRADE LOG'!EM5,\"\")","v":{"v":-78.56499999999994,"d":"$-78.6"}},{"$nulls":5},"         Profit Factor",{"$f":"IFERROR(BJ9,0)","v":{"v":1.4480342868291298,"d":"1.45"}},null,{"$f":"IFERROR(AZ9,0)","v":{"v":1.468479096268372,"d":"1.47"}},{"$f":"IFERROR(BE9,0)","v":{"v":0.57293820353779,"d":"0.57"}},{"$nulls":5},{"$f":"BG9","v":{"v":-30.983333333333334,"d":"(30.98)"}},"SHORT",null,"SHORT",{"$nulls":13},"Short Net P&L",{"$nulls":9},"W&L Ratio:",{"$f":"IFERROR(AY4/AZ4,AY4& \" : \" & 0)","v":{"v":0.7931034482758621,"d":"0.79"}},"P&L Ratio:",{"$f":"IFERROR(IFERROR(BA4/BB4,(ROUND(BA4,1) &\" : \" &\"0\")),\"0 : 0\")","v":{"v":1.85156059964273,"d":"1.85"}},null,"W&L Ratio:",{"$f":"IFERROR(BD4/BE4,BD4& \" : \" & 0)","v":{"v":2,"d":"2.00"}},"P&L Ratio:",{"$f":"IFERROR(IFERROR(BF4/BG4,(ROUND(BF4,1) &\" : \" &\"0\")),\"0 : 0\")","v":0.286469101768895},null,"W&L Ratio:",{"$f":"IFERROR(BI4/BJ4,BI4& \" : \" & 0)","v":{"v":0.8333333333333334,"d":"0.83"}},"P&L Ratio:",{"$f":"IFERROR(IFERROR(BK4/BL4,(ROUND(BK4,1) &\" : \" &\"0\")),\"0 : 0\")","v":{"v":1.7376411441949557,"d":"1.74"}}]
[null,null,{"$f":"IFERROR(\"              \"&'TRADE LOG'!EL6,\"\")","v":""},null,{"$f":"IFERROR('TRADE LOG'!EJ6,\"\")","v":""},{"$f":"IFERROR('TRADE LOG'!EO6,\"\")","v":""},{"$f":"IFERROR('TRADE LOG'!EN6,\"\")","v":""},{"$f":"IFERROR('TRADE LOG'!EM6,\"\")","v":""},{"$nulls":5},"         Expectancy",{"$f":"BL9","v":{"v":77.66218181818192,"d":"$77.7"}},null,{"$f":"BB9","v":{"v":83.93019230769238,"d":"$83.9"}},{"$f":"BG9","v":{"v":-30.983333333333334,"d":"$-31.0"}},{"$nulls":5},{"$f":"BL9","v":{"v":77.66218181818192,"d":"$77.66"}},"TOTAL",null,"TOTAL",{"$nulls":13},{"$f":"IFERROR(AU6+AU4,0)","v":4271.4200000000055},null,{"$f":"AW6+AW4","v":0.08542840000000013},{"$nulls":7},"Profit Factor",{"$f":"(AY6*BA4)/(AZ6*BB4)","v":{"v":1.468479096268372,"d":"1.47"}},"Expectancy",{"$f":"(AY6*BA4)-(AZ6*BB4)","v":{"v":83.93019230769238,"d":"83.93"}},null,"Profit Factor",{"$f":"(BD6*BF4)/(BE6*BG4)","v":{"v":0.57293820353779,"d":"0.57"}},"Expectancy",{"$f":"(BD6*BF4)-(BE6*BG4)","v":-30.983333333333334},null,"Profit Factor",{"$f":"(BI6*BK4)/(BJ6*BL4)","v":{"v":1.4480342868291298,"d":"1.45"}},"Expectancy",{"$f":"(BI6*BK4)-(BJ6*BL4)","v":{"v":77.66218181818192,"d":"77.66"}}]
[null,null,{"$f":"IFERROR(\"              \"&'TRADE LOG'!EL7,\"\")","v":""},null,{"$f":"IFERROR('TRADE LOG'!EJ7,\"\")","v":""},{"$f":"IFERROR('TRADE LOG'!EO7,\"\")","v":""},{"$f":"IFERROR('TRADE LOG'!EN7,\"\")","v":""},{"$f":"IFERROR('TRADE LOG'!EM7,\"\")","v":""},{"$nulls":15},"Stock Position Amount:  ",{"$nulls":16},"Total Net P&L"]
[]
[]
[null,null,"ALL TRADES",{"$nulls":6},"LONG TRADES",{"$nulls":5},"SHORT TRADES",{"$nulls":7},"Rocketsheets"]
[null,null,"ITEM","NET PROFIT","TRADES (WIN%)","P/RATIO","P/FACTOR","EXPECTANCY",null,"NET PROFIT","TRADES (WIN%)","P/RATIO","P/FACTOR","EXPECTANCY",null,"NET PROFIT","TRADES (WIN%)","P/RATIO","P/FACTOR","EXPECTANCY",{"$nulls":14},"Unique Symbol",null,"LONG",{"$nulls":4},"LONG",{"$nulls":3},"SHORT",{"$nulls":8},"TOTAL"]
[null,"No.","TOTAL",{"$f":"AO9","v":{"v":4271.4200000000055,"d":"$4,271.4"}},{"$f":"CONCATENATE(BI4+BJ4,\" (\",TEXT(BI6,\"0.0%\"),\")\")","v":"55 (45.5%)"},{"$f":"BL8","v":{"v":1.7376411441949557,"d":"1.74"}},{"$f":"IFERROR(BJ9,\"\")","v":{"v":1.4480342868291298,"d":"1.45"}},{"$f":"BL9","v":{"v":77.66218181818192,"d":"$77.7"}},null,{"$f":"AO5","v":{"v":4364.370000000006,"d":"$4,364.4"}},{"$f":"CONCATENATE(AY4+AZ4,\" (\",TEXT(AY6,\"0.0%\"),\")\")","v":"52 (44.2%)"},{"$f":"BB8","v":{"v":1.85156059964273,"d":"1.85"}},{"$f":"IFERROR(AZ9,\"\")","v":{"v":1.468479096268372,"d":"1.47"}},{"$f":"BB9","v":{"v":83.93019230769238,"d":"$83.9"}},null,{"$f":"AO7","v":{"v":-92.95000000000002,"d":"$-93.0"}},{"$f":"CONCATENATE(BD4+BE4,\" (\",TEXT(BD6,\"0.0%\"),\")\")","v":"3 (66.7%)"},{"$f":"BG8","v":{"v":0.286469101768895,"d":"0.29"}},{"$f":"IFERROR(BE9,\"\")","v":{"v":0.57293820353779,"d":"0.57"}},{"$f":"BG9","v":{"v":-30.983333333333334,"d":"$-31.0"}},{"$nulls":3},{"$f":"IFERROR('MONTHLY REPORT'!G14,\"xxx\")","v":16146.939999999999},null,"total","mach","item","long profit","short profit",{"$nulls":4},"sorting name","Stock Code","Total Bought","Profir","Loss","Net PNL",null,"trades","win trades","win rate","stats","total buy","profit","loss","pnl",null,"trades","win trades","win rate","stats","profit","loss","pnl","TOTAL TRADES","TOTAL WINS","total win rate","total stats","Total buy","pnl%","AVEW","AVEL","EXP","pofit ratio","profit factor","ave.profit","ave.Loss","expectancy","profit ratio","profit factor","ave.profit","ave.Loss","expectancy","profit ratio","profit factor"]
[null,1,{"$f":"IFERROR(AB16,\"\")","v":"AUDUSD"},{"$f":"IFERROR(P16+J16,\"\")","v":{"v":4767.849999999999,"d":"$4,767.9"}},{"$f":"IFERROR(INDEX($BI$16:$BI$65,AA16),\"\")","v":"19 (63.2%)"},{"$f":"IFERROR(INDEX($BO$16:$BO$65,AA16),\"\")","v":{"v":2.225591213722653,"d":"2.23"}},{"$f":"IFERROR(INDEX($BP$16:$BP$65,AA16),\"\")","v":{"v":3.8152992235245473,"d":"3.82"}},{"$f":"IFERROR(INDEX($BN$16:$BN$65,AA16),\"\")","v":{"v":250.93947368421044,"d":"$250.9"}},null,{"$f":"IFERROR(AC16,\"\")","v":{"v":4908.15,"d":"$4,908.2"}},{"$f":"IFERROR(INDEX($AS$16:$AS$65,AA16),\"\")","v":"17 (64.7%)"},{"$f":"IFERROR(INDEX($BT$16:$BT$65,AA16),\"\")","v":{"v":2.359380100893753,"d":"2.36"}},{"$f":"IFERROR(INDEX($BU$16:$BU$65,AA16),\"\")","v":{"v":4.325530184971881,"d":"4.33"}},{"$f":"IFERROR(INDEX($BS$16:$BS$65,AA16),\"\")","v":{"v":288.7147058823529,"d":"$288.7"}},null,{"$f":"IFERROR(AD16,\"\")","v":{"v":-140.3,"d":"$-140.3"}},{"$f":"IFERROR(INDEX($BB$16:$BB$65,AA16),\"\")","v":"2 (50.0%)"},{"$f":"IFERROR(INDEX($BY$16:$BY$65,AA16),\"\")","v":{"v":0.3553870893636572,"d":"0.36"}},{"$f":"IFERROR(INDEX($BZ$16:$BZ$65,AA16),\"\")","v":{"v":0.3553870893636572,"d":"0.36"}},{"$f":"IFERROR(INDEX($BX$16:$BX$65,AA16),\"\")","v":{"v":-70.15,"d":"$-70.2"}},{"$nulls":5},{"$f":"LARGE($BE$16:$BE$66,B16)","v":4767.850009999999},{"$f":"MATCH(Z16,$BE$16:$BE$66,0)","v":1},{"$f":"INDEX($AJ$16:$AJ$66,AA16)","v":"AUDUSD"},{"$f":"INDEX($AN$16:$AN$66,AA16)","v":{"v":4908.15,"d":"4,908.15"}},{"$f":"INDEX($AW$16:$AW$66,AA16)","v":{"v":-140.3,"d":"(140.30)"}},{"$nulls":4},{"$f":"SMALL('TRADE LOG'!$AQ$15:$AQ$9733,'TRADE LOG'!B15)","v":2},{"$f":"IFERROR(INDEX(StockLog,AI16),\"\")","v":"AUDUSD"},{"$f":"(SUMIFS(BuyAmount,StockLog,AJ16,ActionLog,\"buy\"))","v":96498.89999999903},{"$f":"SUMIFS(PNLwFees,StockLog,AJ16,ActionLog,\"BUY\",WL,\"W\")","v":6384.049999999999},{"$f":"SUMIFS(PNLwFees,StockLog,AJ16,ActionLog,\"BUY\",WL,\"L\")","v":-1475.9},{"$f":"AL16+AM16","v":4908.15},null,{"$f":"(COUNTIFS(StockLog,AJ16,ActionLog,\"buy\",StockLog,\"<>0\"))","v":17},{"$f":"(COUNTIFS(StockLog,AJ16,PNLwFees,\">0\",ActionLog,\"buy\"))","v":11},{"$f":"AQ16/AP16","v":0.6470588235294118},{"$f":"CONCATENATE(AP16,\" (\",TEXT(AR16,\"0.0%\"),\")\")","v":"17 (64.7%)"},{"$f":"SUMIFS(NetAmount,StockLog,AJ16,ActionLog,\"sell\")","v":6617.050000001456},{"$f":"SUMIFS(PNLwFees,StockLog,AJ16,ActionLog,\"sell\",WL,\"W\")","v":77.35},{"$f":"SUMIFS(PNLwFees,StockLog,AJ16,ActionLog,\"sell\",WL,\"L\")","v":-217.65},{"$f":"AU16+AV16","v":-140.3},null,{"$f":"(COUNTIFS(StockLog,AJ16,ActionLog,\"sell\",StockLog,\"<>0\"))","v":2},{"$f":"(COUNTIFS(StockLog,AJ16,WL,\"W\",ActionLog,\"sell\"))","v":1},{"$f":"AZ16/AY16","v":0.5},{"$f":"CONCATENATE(AY16,\" (\",TEXT(BA16,\"0.0%\"),\")\")","v":"2 (50.0%)"},{"$f":"AL16+AU16","v":6461.4},{"$f":"AV16+AM16","v":-1693.5500000000002},{"$f":"IF(AJ16=\"\",\"\",BD16+BC16+'TRADE LOG'!AR15)","v":4767.850009999999},{"$f":"AP16+AY16","v":19},{"$f":"AQ16+AZ16","v":12},{"$f":"BG16/BF16","v":0.631578947368421},{"$f":"CONCATENATE(BF16,\" (\",TEXT(BH16,\"0.0%\"),\")\")","v":"19 (63.2%)"},{"$f":"AK16+AT16","v":103115.95000000049},{"$f":"BE16/BJ16","v":0.0462377547799344},{"$f":"BC16/BG16","v":538.4499999999999},{"$f":"BD16/(BF16-BG16)","v":-241.9357142857143},{"$f":"(BL16*BH16)-((1-BH16)*-BM16)","v":250.93947368421044},{"$f":"BL16/-BM16","v":2.225591213722653},{"$f":"(BL16*BH16)/((1-BH16)*-BM16)","v":3.8152992235245473},{"$f":"IFERROR(AL16/AQ16,0)","v":580.3681818181817},{"$f":"IFERROR(AM16/(AP16-AQ16),0)","v":-245.98333333333335},{"$f":"(BQ16*AR16)-((1-AR16)*-BR16)","v":288.7147058823529},{"$f":"BQ16/-BR16","v":2.359380100893753},{"$f":"(BQ16*AR16)/((1-AR16)*-BR16)","v":4.325530184971881},{"$f":"IFERROR(AU16/AZ16,0)","v":77.35},{"$f":"IFERROR(AV16/(AY16-AZ16),0)","v":-217.65},{"$f":"(BV16*BA16)-((1-BA16)*-BW16)","v":-70.15},{"$f":"BV16/-BW16","v":0.3553870893636572},{"$f":"(BV16*BA16)/((1-BA16)*-BW16)","v":0.3553870893636572}]
[null,2,{"$f":"IFERROR(AB17,\"\")","v":"GBPUSD"},{"v":527.3,"d":"$527.3"},{"$f":"IFERROR(INDEX($BI$16:$BI$65,AA17),\"\")","v":"6 (33.3%)"},{"$f":"IFERROR(INDEX($BO$16:$BO$65,AA17),\"\")","v":{"v":2.9102757757541755,"d":"2.91"}},{"$f":"IFERROR(INDEX($BP$16:$BP$65,AA17),\"\")","v":{"v":1.4551378878770875,"d":"1.46"}},{"$f":"IFERROR(INDEX($BN$16:$BN$65,AA17),\"\")","v":{"v":87.8833333333333,"d":"$87.9"}},null,{"v":527.3,"d":"$527.3"},{"$f":"IFERROR(INDEX($AS$16:$AS$65,AA17),\"\")","v":"6 (33.3%)"},{"$f":"IFERROR(INDEX($BT$16:$BT$65,AA17),\"\")","v":{"v":2.9102757757541755,"d":"2.91"}},{"$f":"IFERROR(INDEX($BU$16:$BU$65,AA17),\"\")","v":{"v":1.4551378878770875,"d":"1.46"}},{"$f":"IFERROR(INDEX($BS$16:$BS$65,AA17),\"\")","v":{"v":87.8833333333333,"d":"$87.9"}},null,0,{"$f":"IFERROR(INDEX($BB$16:$BB$65,AA17),\"\")","v":""},{"$f":"IFERROR(INDEX($BY$16:$BY$65,AA17),\"\")","v":""},{"$f":"IFERROR(INDEX($BZ$16:$BZ$65,AA17),\"\")","v":""},{"$f":"IFERROR(INDEX($BX$16:$BX$65,AA17),\"\")","v":""},{"$nulls":5},527.30004,4,"GBPUSD",{"v":527.3,"d":"527.30"},0,{"$nulls":4},{"$f":"SMALL('TRADE LOG'!$AQ$15:$AQ$9733,'TRADE LOG'!B16)","v":3},"XAUUSD",5204230.000000487,110,-520,-410,null,4,1,0.25,"4 (25.0%)",0,0,0,0,null,0,0,{"$error":"#DIV/0!"},{"$error":"#DIV/0!"},110,-520,{"$f":"IF(AJ17=\"\",\"\",BD17+BC17+'TRADE LOG'!AR16)","v":-409.99998},4,1,0.25,"4 (25.0%)",5204230.000000487,-7.8782063821153487E-5,110,-173.33333333333334,-102.5,0.6346153846153846,0.21153846153846154,{"$f":"IFERROR(AL17/AQ17,0)","v":110},-173.33333333333334,-102.5,0.6346153846153846,0.21153846153846154,{"$f":"IFERROR(AU17/AZ17,0)","v":0},{"$f":"IFERROR(AV17/(AY17-AZ17),0)","v":0},{"$error":"#DIV/0!"},{"$error":"#DIV/0!"},{"$error":"#DIV/0!"}]
[null,3,"USDJPY",{"v":-65.69000000000003,"d":"$-65.7"},"3 (33.3%)",{"v":1.5858003089630819,"d":"1.59"},{"v":0.7929001544815408,"d":"0.79"},{"v":-21.89666666666669,"d":"$-21.9"},null,{"v":-65.69000000000003,"d":"$-65.7"},{"$f":"IFERROR(INDEX($AS$16:$AS$65,AA18),\"\")","v":"3 (33.3%)"},{"v":1.5858003089630819,"d":"1.59"},{"v":0.7929001544815408,"d":"0.79"},{"v":-21.89666666666669,"d":"$-21.9"},null,0,"","","","",{"$nulls":5},-65.68995000000002,5,"USDJPY",{"v":-65.69000000000003,"d":"(65.69)"},0,{"$nulls":4},{"$f":"SMALL('TRADE LOG'!$AQ$15:$AQ$9733,'TRADE LOG'!B17)","v":4},"EURUSD",187015.08790000356,3299.9199999999996,-3766.4000000000005,-466.4800000000009,null,17,6,0.35294117647058826,"17 (35.3%)",5504.499999999887,47.35,0,47.35,null,1,1,1,"1 (100.0%)",3347.2699999999995,-3766.4000000000005,{"$f":"IF(AJ18=\"\",\"\",BD18+BC18+'TRADE LOG'!AR17)","v":-419.12997000000104},18,7,0.3888888888888889,"18 (38.9%)",192519.58790000345,-2.1770770162758777E-3,478.1814285714285,-342.40000000000003,-23.285000000000053,1.3965579105473962,0.888718670348343,549.9866666666666,-342.40000000000003,-27.440000000000026,1.606269470404984,0.8761469838572641,47.35,0,47.35,{"$error":"#DIV/0!"},{"$error":"#DIV/0!"}]
[null,4,"USDCAD",{"v":-128.91000000000008,"d":"$-128.9"},"5 (40.0%)",{"v":1.406946583253128,"d":"1.41"},{"v":0.9379643888354187,"d":"0.94"},{"v":-25.781999999999982,"d":"$-25.8"},null,{"v":-128.91000000000008,"d":"$-128.9"},"5 (40.0%)",{"v":1.406946583253128,"d":"1.41"},{"v":0.9379643888354187,"d":"0.94"},{"v":-25.781999999999982,"d":"$-25.8"},null,0,"","","","",{"$nulls":5},-128.9099400000001,6,"USDCAD",{"v":-128.91000000000008,"d":"(128.91)"},0,{"$nulls":4},{"$f":"SMALL('TRADE LOG'!$AQ$15:$AQ$9733,'TRADE LOG'!B18)","v":26},"GBPUSD",110928.70000003766,1685.85,-1158.55,527.3,null,6,2,0.3333333333333333,"6 (33.3%)",0,0,0,0,null,0,0,{"$error":"#DIV/0!"},{"$error":"#DIV/0!"},1685.85,-1158.55,{"$f":"IF(AJ19=\"\",\"\",BD19+BC19+'TRADE LOG'!AR18)","v":527.30004},6,2,0.3333333333333333,"6 (33.3%)",110928.70000003766,0.004753504187823538,842.925,-289.6375,87.8833333333333,2.9102757757541755,1.4551378878770875,842.925,-289.6375,87.8833333333333,2.9102757757541755,1.4551378878770875,0,0,{"$error":"#DIV/0!"},{"$error":"#DIV/0!"},{"$error":"#DIV/0!"}]
[null,5,"XAUUSD",{"v":-410,"d":"$-410.0"},"4 (25.0%)",{"v":0.6346153846153846,"d":"0.63"},{"v":0.21153846153846154,"d":"0.21"},{"v":-102.5,"d":"$-102.5"},null,{"v":-410,"d":"$-410.0"},"4 (25.0%)",{"v":0.6346153846153846,"d":"0.63"},{"v":0.21153846153846154,"d":"0.21"},{"v":-102.5,"d":"$-102.5"},null,0,"","","","",{"$nulls":5},-409.99998,2,"XAUUSD",{"v":-410,"d":"(410.00)"},0,{"$nulls":4},{"$f":"SMALL('TRADE LOG'!$AQ$15:$AQ$9733,'TRADE LOG'!B19)","v":28},"USDJPY",19998.612595157952,251.49999999999997,-317.19,-65.69000000000003,null,3,1,0.3333333333333333,"3 (33.3%)",0,0,0,0,null,0,0,{"$error":"#DIV/0!"},{"$error":"#DIV/0!"},251.49999999999997,-317.19,{"$f":"IF(AJ20=\"\",\"\",BD20+BC20+'TRADE LOG'!AR19)","v":-65.68995000000002},3,1,0.3333333333333333,"3 (33.3%)",19998.612595157952,-3.2847253621936163E-3,251.49999999999997,-158.595,-21.89666666666669,1.5858003089630819,0.7929001544815408,251.49999999999997,{"$f":"IFERROR(AM20/(AP20-AQ20),0)","v":-158.595},-21.89666666666669,1.5858003089630819,0.7929001544815408,0,0,{"$error":"#DIV/0!"},{"$error":"#DIV/0!"},{"$error":"#DIV/0!"}]
[null,6,"EURUSD",{"v":-419.1300000000009,"d":"$-419.1"},"18 (38.9%)",{"v":1.3965579105473962,"d":"1.40"},{"v":0.888718670348343,"d":"0.89"},{"v":-23.285000000000053,"d":"$-23.3"},null,{"v":-466.4800000000009,"d":"$-466.5"},"17 (35.3%)",{"v":1.606269470404984,"d":"1.61"},{"v":0.8761469838572641,"d":"0.88"},{"v":-27.440000000000026,"d":"$-27.4"},null,{"v":47.35,"d":"$47.4"},"1 (100.0%)","","",{"v":47.35,"d":"$47.4"},{"$nulls":5},-419.12997000000104,3,"EURUSD",{"v":-466.4800000000009,"d":"(466.48)"},47.35,{"$nulls":4},{"$f":"SMALL('TRADE LOG'!$AQ$15:$AQ$9733,'TRADE LOG'!B20)","v":36},"USDCAD",219983.6378478425,1949.09,-2078,-128.91000000000008,null,5,2,0.4,"5 (40.0%)",0,0,0,0,null,0,0,{"$error":"#DIV/0!"},{"$error":"#DIV/0!"},1949.09,-2078,{"$f":"IF(AJ21=\"\",\"\",BD21+BC21+'TRADE LOG'!AR20)","v":-128.9099400000001},5,2,0.4,"5 (40.0%)",219983.6378478425,-5.8599785539124535E-4,974.545,-692.6666666666666,-25.781999999999982,1.406946583253128,0.9379643888354187,974.545,{"$f":"IFERROR(AM21/(AP21-AQ21),0)","v":-692.6666666666666},-25.781999999999982,1.406946583253128,0.9379643888354187,0,0,{"$error":"#DIV/0!"},{"$error":"#DIV/0!"},{"$error":"#DIV/0!"}]
[null,7,"","","","","","",null,"","","","","",null,"","","","","",{"$nulls":5},{"$error":"#NUM!"},{"$error":"#NUM!"},{"$error":"#NUM!"},{"$error":"#NUM!"},{"$error":"#NUM!"},{"$nulls":4},{"$f":"SMALL('TRADE LOG'!$AQ$15:$AQ$9733,'TRADE LOG'!B21)","v":{"$error":"#NUM!"}},"",0,0,0,0,null,0,0,{"$error":"#DIV/0!"},{"$error":"#DIV/0!"},0,0,0,0,null,0,0,{"$error":"#DIV/0!"},{"$error":"#DIV/0!"},0,0,{"$f":"IF(AJ22=\"\",\"\",BD22+BC22+'TRADE LOG'!AR21)","v":""},0,0,{"$error":"#DIV/0!"},{"$error":"#DIV/0!"},0,{"$error":"#VALUE!"},{"$error":"#DIV/0!"},{"$error":"#DIV/0!"},{"$error":"#DIV/0!"},{"$error":"#DIV/0!"},{"$error":"#DIV/0!"},0,0,{"$error":"#DIV/0!"},{"$error":"#DIV/0!"},{"$error":"#DIV/0!"},0,0,{"$error":"#DIV/0!"},{"$error":"#DIV/0!"},{"$error":"#DIV/0!"}]
[null,8,"","","","","","",null,"","","","","",null,"","","","","",{"$nulls":5},{"$error":"#NUM!"},{"$error":"#NUM!"},{"$error":"#NUM!"},{"$error":"#NUM!"},{"$error":"#NUM!"},{"$nulls":4},{"$f":"SMALL('TRADE LOG'!$AQ$15:$AQ$9733,'TRADE LOG'!B22)","v":{"$error":"#NUM!"}},"",0,0,0,0,null,0,0,{"$error":"#DIV/0!"},{"$error":"#DIV/0!"},0,0,0,0,null,0,0,{"$error":"#DIV/0!"},{"$error":"#DIV/0!"},0,0,{"$f":"IF(AJ23=\"\",\"\",BD23+BC23+'TRADE LOG'!AR22)","v":""},0,0,{"$error":"#DIV/0!"},{"$error":"#DIV/0!"},0,{"$error":"#VALUE!"},{"$error":"#DIV/0!"},{"$error":"#DIV/0!"},{"$error":"#DIV/0!"},{"$error":"#DIV/0!"},{"$error":"#DIV/0!"},0,0,{"$error":"#DIV/0!"},{"$error":"#DIV/0!"},{"$error":"#DIV/0!"},0,0,{"$error":"#DIV/0!"},{"$error":"#DIV/0!"},{"$error":"#DIV/0!"}]
[null,9,"","","","","","",null,"","","","","",null,"","","","","",{"$nulls":5},{"$error":"#NUM!"},{"$error":"#NUM!"},{"$error":"#NUM!"},{"$error":"#NUM!"},{"$error":"#NUM!"},{"$nulls":4},{"$f":"SMALL('TRADE LOG'!$AQ$15:$AQ$9733,'TRADE LOG'!B23)","v":{"$error":"#NUM!"}},"",0,0,0,0,null,0,0,{"$error":"#DIV/0!"},{"$error":"#DIV/0!"},0,0,0,0,null,0,0,{"$error":"#DIV/0!"},{"$error":"#DIV/0!"},0,0,{"$f":"IF(AJ24=\"\",\"\",BD24+BC24+'TRADE LOG'!AR23)","v":""},0,0,{"$error":"#DIV/0!"},{"$error":"#DIV/0!"},0,{"$error":"#VALUE!"},{"$error":"#DIV/0!"},{"$error":"#DIV/0!"},{"$error":"#DIV/0!"},{"$error":"#DIV/0!"},{"$error":"#DIV/0!"},0,0,{"$error":"#DIV/0!"},{"$error":"#DIV/0!"},{"$error":"#DIV/0!"},0,0,{"$error":"#DIV/0!"},{"$error":"#DIV/0!"},{"$error":"#DIV/0!"}]
[null,10,"","","","","","",null,"","","","","",null,"","","","","",{"$nulls":5},{"$error":"#NUM!"},{"$error":"#NUM!"},{"$error":"#NUM!"},{"$error":"#NUM!"},{"$error":"#NUM!"},{"$nulls":4},{"$f":"SMALL('TRADE LOG'!$AQ$15:$AQ$9733,'TRADE LOG'!B24)","v":{"$error":"#NUM!"}},"",0,0,0,0,null,0,0,{"$error":"#DIV/0!"},{"$error":"#DIV/0!"},0,0,0,0,null,0,0,{"$error":"#DIV/0!"},{"$error":"#DIV/0!"},0,0,{"$f":"IF(AJ25=\"\",\"\",BD25+BC25+'TRADE LOG'!AR24)","v":""},0,0,{"$error":"#DIV/0!"},{"$error":"#DIV/0!"},0,{"$error":"#VALUE!"},{"$error":"#DIV/0!"},{"$error":"#DIV/0!"},{"$error":"#DIV/0!"},{"$error":"#DIV/0!"},{"$error":"#DIV/0!"},0,0,{"$error":"#DIV/0!"},{"$error":"#DIV/0!"},{"$error":"#DIV/0!"},0,0,{"$error":"#DIV/0!"},{"$error":"#DIV/0!"},{"$error":"#DIV/0!"}]
[null,11,"","","","","","",null,"","","","","",null,"","","","","",{"$nulls":5},{"$error":"#NUM!"},{"$error":"#NUM!"},{"$error":"#NUM!"},{"$error":"#NUM!"},{"$error":"#NUM!"},{"$nulls":4},{"$f":"SMALL('TRADE LOG'!$AQ$15:$AQ$9733,'TRADE LOG'!B25)","v":{"$error":"#NUM!"}},"",0,0,0,0,null,0,0,{"$error":"#DIV/0!"},{"$error":"#DIV/0!"},0,0,0,0,null,0,0,{"$error":"#DIV/0!"},{"$error":"#DIV/0!"},0,0,{"$f":"IF(AJ26=\"\",\"\",BD26+BC26+'TRADE LOG'!AR25)","v":""},0,0,{"$error":"#DIV/0!"},{"$error":"#DIV/0!"},0,{"$error":"#VALUE!"},{"$error":"#DIV/0!"},{"$error":"#DIV/0!"},{"$error":"#DIV/0!"},{"$error":"#DIV/0!"},{"$error":"#DIV/0!"},0,0,{"$error":"#DIV/0!"},{"$error":"#DIV/0!"},{"$error":"#DIV/0!"},0,0,{"$error":"#DIV/0!"},{"$error":"#DIV/0!"},{"$error":"#DIV/0!"}]
[null,12,"","","","","","",null,"","","","","",null,"","","","","",{"$nulls":5},{"$error":"#NUM!"},{"$error":"#NUM!"},{"$error":"#NUM!"},{"$error":"#NUM!"},{"$error":"#NUM!"},{"$nulls":4},{"$f":"SMALL('TRADE LOG'!$AQ$15:$AQ$9733,'TRADE LOG'!B26)","v":{"$error":"#NUM!"}},"",0,0,0,0,null,0,0,{"$error":"#DIV/0!"},{"$error":"#DIV/0!"},0,0,0,0,null,0,0,{"$error":"#DIV/0!"},{"$error":"#DIV/0!"},0,0,{"$f":"IF(AJ27=\"\",\"\",BD27+BC27+'TRADE LOG'!AR26)","v":""},0,0,{"$error":"#DIV/0!"},{"$error":"#DIV/0!"},0,{"$error":"#VALUE!"},{"$error":"#DIV/0!"},{"$error":"#DIV/0!"},{"$error":"#DIV/0!"},{"$error":"#DIV/0!"},{"$error":"#DIV/0!"},0,0,{"$error":"#DIV/0!"},{"$error":"#DIV/0!"},{"$error":"#DIV/0!"},0,0,{"$error":"#DIV/0!"},{"$error":"#DIV/0!"},{"$error":"#DIV/0!"}]
[null,13,"","","","","","",null,"","","","","",null,"","","","","",{"$nulls":5},{"$error":"#NUM!"},{"$error":"#NUM!"},{"$error":"#NUM!"},{"$error":"#NUM!"},{"$error":"#NUM!"},{"$nulls":4},{"$f":"SMALL('TRADE LOG'!$AQ$15:$AQ$9733,'TRADE LOG'!B27)","v":{"$error":"#NUM!"}},"",0,0,0,0,null,0,0,{"$error":"#DIV/0!"},{"$error":"#DIV/0!"},0,0,0,0,null,0,0,{"$error":"#DIV/0!"},{"$error":"#DIV/0!"},0,0,{"$f":"IF(AJ28=\"\",\"\",BD28+BC28+'TRADE LOG'!AR27)","v":""},0,0,{"$error":"#DIV/0!"},{"$error":"#DIV/0!"},0,{"$error":"#VALUE!"},{"$error":"#DIV/0!"},{"$error":"#DIV/0!"},{"$error":"#DIV/0!"},{"$error":"#DIV/0!"},{"$error":"#DIV/0!"},0,0,{"$error":"#DIV/0!"},{"$error":"#DIV/0!"},{"$error":"#DIV/0!"},0,0,{"$error":"#DIV/0!"},{"$error":"#DIV/0!"},{"$error":"#DIV/0!"}]
[null,14,"","","","","","",null,"","","","","",null,"","","","","",{"$nulls":5},{"$error":"#NUM!"},{"$error":"#NUM!"},{"$error":"#NUM!"},{"$error":"#NUM!"},{"$error":"#NUM!"},{"$nulls":4},{"$f":"SMALL('TRADE LOG'!$AQ$15:$AQ$9733,'TRADE LOG'!B28)","v":{"$error":"#NUM!"}},"",0,0,0,0,null,0,0,{"$error":"#DIV/0!"},{"$error":"#DIV/0!"},0,0,0,0,null,0,0,{"$error":"#DIV/0!"},{"$error":"#DIV/0!"},0,0,{"$f":"IF(AJ29=\"\",\"\",BD29+BC29+'TRADE LOG'!AR28)","v":""},0,0,{"$error":"#DIV/0!"},{"$error":"#DIV/0!"},0,{"$error":"#VALUE!"},{"$error":"#DIV/0!"},{"$error":"#DIV/0!"},{"$error":"#DIV/0!"},{"$error":"#DIV/0!"},{"$error":"#DIV/0!"},0,0,{"$error":"#DIV/0!"},{"$error":"#DIV/0!"},{"$error":"#DIV/0!"},0,0,{"$error":"#DIV/0!"},{"$error":"#DIV/0!"},{"$error":"#DIV/0!"}]
[null,15,"","","","","","",null,"","","","","",null,"","","","","",{"$nulls":5},{"$error":"#NUM!"},{"$error":"#NUM!"},{"$error":"#NUM!"},{"$error":"#NUM!"},{"$error":"#NUM!"},{"$nulls":4},{"$f":"SMALL('TRADE LOG'!$AQ$15:$AQ$9733,'TRADE LOG'!B29)","v":{"$error":"#NUM!"}},"",0,0,0,0,null,0,0,{"$error":"#DIV/0!"},{"$error":"#DIV/0!"},0,0,0,0,null,0,0,{"$error":"#DIV/0!"},{"$error":"#DIV/0!"},0,0,{"$f":"IF(AJ30=\"\",\"\",BD30+BC30+'TRADE LOG'!AR29)","v":""},0,0,{"$error":"#DIV/0!"},{"$error":"#DIV/0!"},0,{"$error":"#VALUE!"},{"$error":"#DIV/0!"},{"$error":"#DIV/0!"},{"$error":"#DIV/0!"},{"$error":"#DIV/0!"},{"$error":"#DIV/0!"},0,0,{"$error":"#DIV/0!"},{"$error":"#DIV/0!"},{"$error":"#DIV/0!"},0,0,{"$error":"#DIV/0!"},{"$error":"#DIV/0!"},{"$error":"#DIV/0!"}]
[null,16,"","","","","","",null,"","","","","",null,"","","","","",{"$nulls":5},{"$error":"#NUM!"},{"$error":"#NUM!"},{"$error":"#NUM!"},{"$error":"#NUM!"},{"$error":"#NUM!"},{"$nulls":4},{"$f":"SMALL('TRADE LOG'!$AQ$15:$AQ$9733,'TRADE LOG'!B30)","v":{"$error":"#NUM!"}},"",0,0,0,0,null,0,0,{"$error":"#DIV/0!"},{"$error":"#DIV/0!"},0,0,0,0,null,0,0,{"$error":"#DIV/0!"},{"$error":"#DIV/0!"},0,0,{"$f":"IF(AJ31=\"\",\"\",BD31+BC31+'TRADE LOG'!AR30)","v":""},0,0,{"$error":"#DIV/0!"},{"$error":"#DIV/0!"},0,{"$error":"#VALUE!"},{"$error":"#DIV/0!"},{"$error":"#DIV/0!"},{"$error":"#DIV/0!"},{"$error":"#DIV/0!"},{"$error":"#DIV/0!"},0,0,{"$error":"#DIV/0!"},{"$error":"#DIV/0!"},{"$error":"#DIV/0!"},0,0,{"$error":"#DIV/0!"},{"$error":"#DIV/0!"},{"$error":"#DIV/0!"}]
[null,17,"","","","","","",null,"","","","","",null,"","","","","",{"$nulls":5},{"$error":"#NUM!"},{"$error":"#NUM!"},{"$error":"#NUM!"},{"$error":"#NUM!"},{"$error":"#NUM!"},{"$nulls":4},{"$f":"SMALL('TRADE LOG'!$AQ$15:$AQ$9733,'TRADE LOG'!B31)","v":{"$error":"#NUM!"}},"",0,0,0,0,null,0,0,{"$error":"#DIV/0!"},{"$error":"#DIV/0!"},0,0,0,0,null,0,0,{"$error":"#DIV/0!"},{"$error":"#DIV/0!"},0,0,{"$f":"IF(AJ32=\"\",\"\",BD32+BC32+'TRADE LOG'!AR31)","v":""},0,0,{"$error":"#DIV/0!"},{"$error":"#DIV/0!"},0,{"$error":"#VALUE!"},{"$error":"#DIV/0!"},{"$error":"#DIV/0!"},{"$error":"#DIV/0!"},{"$error":"#DIV/0!"},{"$error":"#DIV/0!"},0,0,{"$error":"#DIV/0!"},{"$error":"#DIV/0!"},{"$error":"#DIV/0!"},0,0,{"$error":"#DIV/0!"},{"$error":"#DIV/0!"},{"$error":"#DIV/0!"}]
[null,18,"","","","","","",null,"","","","","",null,"","","","","",{"$nulls":5},{"$error":"#NUM!"},{"$error":"#NUM!"},{"$error":"#NUM!"},{"$error":"#NUM!"},{"$error":"#NUM!"},{"$nulls":4},{"$f":"SMALL('TRADE LOG'!$AQ$15:$AQ$9733,'TRADE LOG'!B32)","v":{"$error":"#NUM!"}},"",0,0,0,0,null,0,0,{"$error":"#DIV/0!"},{"$error":"#DIV/0!"},0,0,0,0,null,0,0,{"$error":"#DIV/0!"},{"$error":"#DIV/0!"},0,0,{"$f":"IF(AJ33=\"\",\"\",BD33+BC33+'TRADE LOG'!AR32)","v":""},0,0,{"$error":"#DIV/0!"},{"$error":"#DIV/0!"},0,{"$error":"#VALUE!"},{"$error":"#DIV/0!"},{"$error":"#DIV/0!"},{"$error":"#DIV/0!"},{"$error":"#DIV/0!"},{"$error":"#DIV/0!"},0,0,{"$error":"#DIV/0!"},{"$error":"#DIV/0!"},{"$error":"#DIV/0!"},0,0,{"$error":"#DIV/0!"},{"$error":"#DIV/0!"},{"$error":"#DIV/0!"}]
[null,19,"","","","","","",null,"","","","","",null,"","","","","",{"$nulls":5},{"$error":"#NUM!"},{"$error":"#NUM!"},{"$error":"#NUM!"},{"$error":"#NUM!"},{"$error":"#NUM!"},{"$nulls":4},{"$f":"SMALL('TRADE LOG'!$AQ$15:$AQ$9733,'TRADE LOG'!B33)","v":{"$error":"#NUM!"}},"",0,0,0,0,null,0,0,{"$error":"#DIV/0!"},{"$error":"#DIV/0!"},0,0,0,0,null,0,0,{"$error":"#DIV/0!"},{"$error":"#DIV/0!"},0,0,{"$f":"IF(AJ34=\"\",\"\",BD34+BC34+'TRADE LOG'!AR33)","v":""},0,0,{"$error":"#DIV/0!"},{"$error":"#DIV/0!"},0,{"$error":"#VALUE!"},{"$error":"#DIV/0!"},{"$error":"#DIV/0!"},{"$error":"#DIV/0!"},{"$error":"#DIV/0!"},{"$error":"#DIV/0!"},0,0,{"$error":"#DIV/0!"},{"$error":"#DIV/0!"},{"$error":"#DIV/0!"},0,0,{"$error":"#DIV/0!"},{"$error":"#DIV/0!"},{"$error":"#DIV/0!"}]
[null,20,"","","","","","",null,"","","","","",null,"","","","","",{"$nulls":5},{"$error":"#NUM!"},{"$error":"#NUM!"},{"$error":"#NUM!"},{"$error":"#NUM!"},{"$error":"#NUM!"},{"$nulls":4},{"$f":"SMALL('TRADE LOG'!$AQ$15:$AQ$9733,'TRADE LOG'!B34)","v":{"$error":"#NUM!"}},"",0,0,0,0,null,0,0,{"$error":"#DIV/0!"},{"$error":"#DIV/0!"},0,0,0,0,null,0,0,{"$error":"#DIV/0!"},{"$error":"#DIV/0!"},0,0,{"$f":"IF(AJ35=\"\",\"\",BD35+BC35+'TRADE LOG'!AR34)","v":""},0,0,{"$error":"#DIV/0!"},{"$error":"#DIV/0!"},0,{"$error":"#VALUE!"},{"$error":"#DIV/0!"},{"$error":"#DIV/0!"},{"$error":"#DIV/0!"},{"$error":"#DIV/0!"},{"$error":"#DIV/0!"},0,0,{"$error":"#DIV/0!"},{"$error":"#DIV/0!"},{"$error":"#DIV/0!"},0,0,{"$error":"#DIV/0!"},{"$error":"#DIV/0!"},{"$error":"#DIV/0!"}]
[null,21,"","","","","","",null,"","","","","",null,"","","","","",{"$nulls":5},{"$error":"#NUM!"},{"$error":"#NUM!"},{"$error":"#NUM!"},{"$error":"#NUM!"},{"$error":"#NUM!"},{"$nulls":4},{"$f":"SMALL('TRADE LOG'!$AQ$15:$AQ$9733,'TRADE LOG'!B35)","v":{"$error":"#NUM!"}},"",0,0,0,0,null,0,0,{"$error":"#DIV/0!"},{"$error":"#DIV/0!"},0,0,0,0,null,0,0,{"$error":"#DIV/0!"},{"$error":"#DIV/0!"},0,0,{"$f":"IF(AJ36=\"\",\"\",BD36+BC36+'TRADE LOG'!AR35)","v":""},0,0,{"$error":"#DIV/0!"},{"$error":"#DIV/0!"},0,{"$error":"#VALUE!"},{"$error":"#DIV/0!"},{"$error":"#DIV/0!"},{"$error":"#DIV/0!"},{"$error":"#DIV/0!"},{"$error":"#DIV/0!"},0,0,{"$error":"#DIV/0!"},{"$error":"#DIV/0!"},{"$error":"#DIV/0!"},0,0,{"$error":"#DIV/0!"},{"$error":"#DIV/0!"},{"$error":"#DIV/0!"}]
[null,22,"","","","","","",null,"","","","","",null,"","","","","",{"$nulls":5},{"$error":"#NUM!"},{"$error":"#NUM!"},{"$error":"#NUM!"},{"$error":"#NUM!"},{"$error":"#NUM!"},{"$nulls":4},{"$f":"SMALL('TRADE LOG'!$AQ$15:$AQ$9733,'TRADE LOG'!B36)","v":{"$error":"#NUM!"}},"",0,0,0,0,null,0,0,{"$error":"#DIV/0!"},{"$error":"#DIV/0!"},0,0,0,0,null,0,0,{"$error":"#DIV/0!"},{"$error":"#DIV/0!"},0,0,{"$f":"IF(AJ37=\"\",\"\",BD37+BC37+'TRADE LOG'!AR36)","v":""},0,0,{"$error":"#DIV/0!"},{"$error":"#DIV/0!"},0,{"$error":"#VALUE!"},{"$error":"#DIV/0!"},{"$error":"#DIV/0!"},{"$error":"#DIV/0!"},{"$error":"#DIV/0!"},{"$error":"#DIV/0!"},0,0,{"$error":"#DIV/0!"},{"$error":"#DIV/0!"},{"$error":"#DIV/0!"},0,0,{"$error":"#DIV/0!"},{"$error":"#DIV/0!"},{"$error":"#DIV/0!"}]
[null,23,"","","","","","",null,"","","","","",null,"","","","","",{"$nulls":5},{"$error":"#NUM!"},{"$error":"#NUM!"},{"$error":"#NUM!"},{"$error":"#NUM!"},{"$error":"#NUM!"},{"$nulls":4},{"$f":"SMALL('TRADE LOG'!$AQ$15:$AQ$9733,'TRADE LOG'!B37)","v":{"$error":"#NUM!"}},"",0,0,0,0,null,0,0,{"$error":"#DIV/0!"},{"$error":"#DIV/0!"},0,0,0,0,null,0,0,{"$error":"#DIV/0!"},{"$error":"#DIV/0!"},0,0,{"$f":"IF(AJ38=\"\",\"\",BD38+BC38+'TRADE LOG'!AR37)","v":""},0,0,{"$error":"#DIV/0!"},{"$error":"#DIV/0!"},0,{"$error":"#VALUE!"},{"$error":"#DIV/0!"},{"$error":"#DIV/0!"},{"$error":"#DIV/0!"},{"$error":"#DIV/0!"},{"$error":"#DIV/0!"},0,0,{"$error":"#DIV/0!"},{"$error":"#DIV/0!"},{"$error":"#DIV/0!"},0,0,{"$error":"#DIV/0!"},{"$error":"#DIV/0!"},{"$error":"#DIV/0!"}]
[null,24,"","","","","","",null,"","","","","",null,"","","","","",{"$nulls":5},{"$error":"#NUM!"},{"$error":"#NUM!"},{"$error":"#NUM!"},{"$error":"#NUM!"},{"$error":"#NUM!"},{"$nulls":4},{"$f":"SMALL('TRADE LOG'!$AQ$15:$AQ$9733,'TRADE LOG'!B38)","v":{"$error":"#NUM!"}},"",0,0,0,0,null,0,0,{"$error":"#DIV/0!"},{"$error":"#DIV/0!"},0,0,0,0,null,0,0,{"$error":"#DIV/0!"},{"$error":"#DIV/0!"},0,0,{"$f":"IF(AJ39=\"\",\"\",BD39+BC39+'TRADE LOG'!AR38)","v":""},0,0,{"$error":"#DIV/0!"},{"$error":"#DIV/0!"},0,{"$error":"#VALUE!"},{"$error":"#DIV/0!"},{"$error":"#DIV/0!"},{"$error":"#DIV/0!"},{"$error":"#DIV/0!"},{"$error":"#DIV/0!"},0,0,{"$error":"#DIV/0!"},{"$error":"#DIV/0!"},{"$error":"#DIV/0!"},0,0,{"$error":"#DIV/0!"},{"$error":"#DIV/0!"},{"$error":"#DIV/0!"}]
[null,25,"","","","","","",null,"","","","","",null,"","","","","",{"$nulls":5},{"$error":"#NUM!"},{"$error":"#NUM!"},{"$error":"#NUM!"},{"$error":"#NUM!"},{"$error":"#NUM!"},{"$nulls":4},{"$f":"SMALL('TRADE LOG'!$AQ$15:$AQ$9733,'TRADE LOG'!B39)","v":{"$error":"#NUM!"}},"",0,0,0,0,null,0,0,{"$error":"#DIV/0!"},{"$error":"#DIV/0!"},0,0,0,0,null,0,0,{"$error":"#DIV/0!"},{"$error":"#DIV/0!"},0,0,{"$f":"IF(AJ40=\"\",\"\",BD40+BC40+'TRADE LOG'!AR39)","v":""},0,0,{"$error":"#DIV/0!"},{"$error":"#DIV/0!"},0,{"$error":"#VALUE!"},{"$error":"#DIV/0!"},{"$error":"#DIV/0!"},{"$error":"#DIV/0!"},{"$error":"#DIV/0!"},{"$error":"#DIV/0!"},0,0,{"$error":"#DIV/0!"},{"$error":"#DIV/0!"},{"$error":"#DIV/0!"},0,0,{"$error":"#DIV/0!"},{"$error":"#DIV/0!"},{"$error":"#DIV/0!"}]
[null,26,"","","","","","",null,"","","","","",null,"","","","","",{"$nulls":5},{"$error":"#NUM!"},{"$error":"#NUM!"},{"$error":"#NUM!"},{"$error":"#NUM!"},{"$error":"#NUM!"},{"$nulls":4},{"$f":"SMALL('TRADE LOG'!$AQ$15:$AQ$9733,'TRADE LOG'!B40)","v":{"$error":"#NUM!"}},"",0,0,0,0,null,0,0,{"$error":"#DIV/0!"},{"$error":"#DIV/0!"},0,0,0,0,null,0,0,{"$error":"#DIV/0!"},{"$error":"#DIV/0!"},0,0,{"$f":"IF(AJ41=\"\",\"\",BD41+BC41+'TRADE LOG'!AR40)","v":""},0,0,{"$error":"#DIV/0!"},{"$error":"#DIV/0!"},0,{"$error":"#VALUE!"},{"$error":"#DIV/0!"},{"$error":"#DIV/0!"},{"$error":"#DIV/0!"},{"$error":"#DIV/0!"},{"$error":"#DIV/0!"},0,0,{"$error":"#DIV/0!"},{"$error":"#DIV/0!"},{"$error":"#DIV/0!"},0,0,{"$error":"#DIV/0!"},{"$error":"#DIV/0!"},{"$error":"#DIV/0!"}]
[null,27,"","","","","","",null,"","","","","",null,"","","","","",{"$nulls":5},{"$error":"#NUM!"},{"$error":"#NUM!"},{"$error":"#NUM!"},{"$error":"#NUM!"},{"$error":"#NUM!"},{"$nulls":4},{"$f":"SMALL('TRADE LOG'!$AQ$15:$AQ$9733,'TRADE LOG'!B41)","v":{"$error":"#NUM!"}},"",0,0,0,0,null,0,0,{"$error":"#DIV/0!"},{"$error":"#DIV/0!"},0,0,0,0,null,0,0,{"$error":"#DIV/0!"},{"$error":"#DIV/0!"},0,0,{"$f":"IF(AJ42=\"\",\"\",BD42+BC42+'TRADE LOG'!AR41)","v":""},0,0,{"$error":"#DIV/0!"},{"$error":"#DIV/0!"},0,{"$error":"#VALUE!"},{"$error":"#DIV/0!"},{"$error":"#DIV/0!"},{"$error":"#DIV/0!"},{"$error":"#DIV/0!"},{"$error":"#DIV/0!"},0,0,{"$error":"#DIV/0!"},{"$error":"#DIV/0!"},{"$error":"#DIV/0!"},0,0,{"$error":"#DIV/0!"},{"$error":"#DIV/0!"},{"$error":"#DIV/0!"}]
[null,28,"","","","","","",null,"","","","","",null,"","","","","",{"$nulls":5},{"$error":"#NUM!"},{"$error":"#NUM!"},{"$error":"#NUM!"},{"$error":"#NUM!"},{"$error":"#NUM!"},{"$nulls":4},{"$f":"SMALL('TRADE LOG'!$AQ$15:$AQ$9733,'TRADE LOG'!B42)","v":{"$error":"#NUM!"}},"",0,0,0,0,null,0,0,{"$error":"#DIV/0!"},{"$error":"#DIV/0!"},0,0,0,0,null,0,0,{"$error":"#DIV/0!"},{"$error":"#DIV/0!"},0,0,{"$f":"IF(AJ43=\"\",\"\",BD43+BC43+'TRADE LOG'!AR42)","v":""},0,0,{"$error":"#DIV/0!"},{"$error":"#DIV/0!"},0,{"$error":"#VALUE!"},{"$error":"#DIV/0!"},{"$error":"#DIV/0!"},{"$error":"#DIV/0!"},{"$error":"#DIV/0!"},{"$error":"#DIV/0!"},0,0,{"$error":"#DIV/0!"},{"$error":"#DIV/0!"},{"$error":"#DIV/0!"},0,0,{"$error":"#DIV/0!"},{"$error":"#DIV/0!"},{"$error":"#DIV/0!"}]
[null,29,"","","","","","",null,"","","","","",null,"","","","","",{"$nulls":5},{"$error":"#NUM!"},{"$error":"#NUM!"},{"$error":"#NUM!"},{"$error":"#NUM!"},{"$error":"#NUM!"},{"$nulls":4},{"$f":"SMALL('TRADE LOG'!$AQ$15:$AQ$9733,'TRADE LOG'!B43)","v":{"$error":"#NUM!"}},"",0,0,0,0,null,0,0,{"$error":"#DIV/0!"},{"$error":"#DIV/0!"},0,0,0,0,null,0,0,{"$error":"#DIV/0!"},{"$error":"#DIV/0!"},0,0,{"$f":"IF(AJ44=\"\",\"\",BD44+BC44+'TRADE LOG'!AR43)","v":""},0,0,{"$error":"#DIV/0!"},{"$error":"#DIV/0!"},0,{"$error":"#VALUE!"},{"$error":"#DIV/0!"},{"$error":"#DIV/0!"},{"$error":"#DIV/0!"},{"$error":"#DIV/0!"},{"$error":"#DIV/0!"},0,0,{"$error":"#DIV/0!"},{"$error":"#DIV/0!"},{"$error":"#DIV/0!"},0,0,{"$error":"#DIV/0!"},{"$error":"#DIV/0!"},{"$error":"#DIV/0!"}]
[null,30,"","","","","","",null,"","","","","",null,"","","","","",{"$nulls":5},{"$error":"#NUM!"},{"$error":"#NUM!"},{"$error":"#NUM!"},{"$error":"#NUM!"},{"$error":"#NUM!"},{"$nulls":4},{"$f":"SMALL('TRADE LOG'!$AQ$15:$AQ$9733,'TRADE LOG'!B44)","v":{"$error":"#NUM!"}},"",0,0,0,0,null,0,0,{"$error":"#DIV/0!"},{"$error":"#DIV/0!"},0,0,0,0,null,0,0,{"$error":"#DIV/0!"},{"$error":"#DIV/0!"},0,0,{"$f":"IF(AJ45=\"\",\"\",BD45+BC45+'TRADE LOG'!AR44)","v":""},0,0,{"$error":"#DIV/0!"},{"$error":"#DIV/0!"},0,{"$error":"#VALUE!"},{"$error":"#DIV/0!"},{"$error":"#DIV/0!"},{"$error":"#DIV/0!"},{"$error":"#DIV/0!"},{"$error":"#DIV/0!"},0,0,{"$error":"#DIV/0!"},{"$error":"#DIV/0!"},{"$error":"#DIV/0!"},0,0,{"$error":"#DIV/0!"},{"$error":"#DIV/0!"},{"$error":"#DIV/0!"}]
[null,31,"","","","","","",null,"","","","","",null,"","","","","",{"$nulls":5},{"$error":"#NUM!"},{"$error":"#NUM!"},{"$error":"#NUM!"},{"$error":"#NUM!"},{"$error":"#NUM!"},{"$nulls":4},{"$f":"SMALL('TRADE LOG'!$AQ$15:$AQ$9733,'TRADE LOG'!B45)","v":{"$error":"#NUM!"}},"",0,0,0,0,null,0,0,{"$error":"#DIV/0!"},{"$error":"#DIV/0!"},0,0,0,0,null,0,0,{"$error":"#DIV/0!"},{"$error":"#DIV/0!"},0,0,{"$f":"IF(AJ46=\"\",\"\",BD46+BC46+'TRADE LOG'!AR45)","v":""},0,0,{"$error":"#DIV/0!"},{"$error":"#DIV/0!"},0,{"$error":"#VALUE!"},{"$error":"#DIV/0!"},{"$error":"#DIV/0!"},{"$error":"#DIV/0!"},{"$error":"#DIV/0!"},{"$error":"#DIV/0!"},0,0,{"$error":"#DIV/0!"},{"$error":"#DIV/0!"},{"$error":"#DIV/0!"},0,0,{"$error":"#DIV/0!"},{"$error":"#DIV/0!"},{"$error":"#DIV/0!"}]
[null,32,"","","","","","",null,"","","","","",null,"","","","","",{"$nulls":5},{"$error":"#NUM!"},{"$error":"#NUM!"},{"$error":"#NUM!"},{"$error":"#NUM!"},{"$error":"#NUM!"},{"$nulls":4},{"$f":"SMALL('TRADE LOG'!$AQ$15:$AQ$9733,'TRADE LOG'!B46)","v":{"$error":"#NUM!"}},"",0,0,0,0,null,0,0,{"$error":"#DIV/0!"},{"$error":"#DIV/0!"},0,0,0,0,null,0,0,{"$error":"#DIV/0!"},{"$error":"#DIV/0!"},0,0,{"$f":"IF(AJ47=\"\",\"\",BD47+BC47+'TRADE LOG'!AR46)","v":""},0,0,{"$error":"#DIV/0!"},{"$error":"#DIV/0!"},0,{"$error":"#VALUE!"},{"$error":"#DIV/0!"},{"$error":"#DIV/0!"},{"$error":"#DIV/0!"},{"$error":"#DIV/0!"},{"$error":"#DIV/0!"},0,0,{"$error":"#DIV/0!"},{"$error":"#DIV/0!"},{"$error":"#DIV/0!"},0,0,{"$error":"#DIV/0!"},{"$error":"#DIV/0!"},{"$error":"#DIV/0!"}]
[null,33,"",{"$f":"IFERROR(P48+J48,\"\")","v":""},"","","","",null,{"$f":"IFERROR(AC48,\"\")","v":""},"","","","",null,{"$f":"IFERROR(AD48,\"\")","v":""},"","","","",{"$nulls":5},{"$f":"LARGE($BE$16:$BE$66,B48)","v":{"$error":"#NUM!"}},{"$f":"MATCH(Z48,$BE$16:$BE$66,0)","v":{"$error":"#NUM!"}},{"$f":"INDEX($AJ$16:$AJ$66,AA48)","v":{"$error":"#NUM!"}},{"$f":"INDEX($AN$16:$AN$66,AA48)","v":{"$error":"#NUM!"}},{"$f":"INDEX($AW$16:$AW$66,AA48)","v":{"$error":"#NUM!"}},{"$nulls":4},{"$f":"SMALL('TRADE LOG'!$AQ$15:$AQ$9733,'TRADE LOG'!B47)","v":{"$error":"#NUM!"}},{"$f":"IFERROR(INDEX(StockLog,AI48),\"\")","v":""},{"$f":"(SUMIFS(BuyAmount,StockLog,AJ48,ActionLog,\"buy\"))","v":0},{"$f":"SUMIFS(PNLwFees,StockLog,AJ48,ActionLog,\"BUY\",WL,\"W\")","v":0},{"$f":"SUMIFS(PNLwFees,StockLog,AJ48,ActionLog,\"BUY\",WL,\"L\")","v":0},{"$f":"AL48+AM48","v":0},null,{"$f":"(COUNTIFS(StockLog,AJ48,ActionLog,\"buy\",StockLog,\"<>0\"))","v":0},{"$f":"(COUNTIFS(StockLog,AJ48,PNLwFees,\">0\",ActionLog,\"buy\"))","v":0},{"$f":"AQ48/AP48","v":{"$error":"#DIV/0!"}},{"$f":"CONCATENATE(AP48,\" (\",TEXT(AR48,\"0.0%\"),\")\")","v":{"$error":"#DIV/0!"}},{"$f":"SUMIFS(NetAmount,StockLog,AJ48,ActionLog,\"sell\")","v":0},{"$f":"SUMIFS(PNLwFees,StockLog,AJ48,ActionLog,\"sell\",WL,\"W\")","v":0},{"$f":"SUMIFS(PNLwFees,StockLog,AJ48,ActionLog,\"sell\",WL,\"L\")","v":0},{"$f":"AU48+AV48","v":0},null,{"$f":"(COUNTIFS(StockLog,AJ48,ActionLog,\"sell\",StockLog,\"<>0\"))","v":0},{"$f":"(COUNTIFS(StockLog,AJ48,WL,\"W\",ActionLog,\"sell\"))","v":0},{"$f":"AZ48/AY48","v":{"$error":"#DIV/0!"}},{"$f":"CONCATENATE(AY48,\" (\",TEXT(BA48,\"0.0%\"),\")\")","v":{"$error":"#DIV/0!"}},{"$f":"AL48+AU48","v":0},{"$f":"AV48+AM48","v":0},{"$f":"IF(AJ48=\"\",\"\",BD48+BC48+'TRADE LOG'!AR47)","v":""},{"$f":"AP48+AY48","v":0},{"$f":"AQ48+AZ48","v":0},{"$f":"BG48/BF48","v":{"$error":"#DIV/0!"}},{"$f":"CONCATENATE(BF48,\" (\",TEXT(BH48,\"0.0%\"),\")\")","v":{"$error":"#DIV/0!"}},{"$f":"AK48+AT48","v":0},{"$f":"BE48/BJ48","v":{"$error":"#VALUE!"}},{"$f":"BC48/BG48","v":{"$error":"#DIV/0!"}},{"$f":"BD48/(BF48-BG48)","v":{"$error":"#DIV/0!"}},{"$f":"(BL48*BH48)-((1-BH48)*-BM48)","v":{"$error":"#DIV/0!"}},{"$f":"BL48/-BM48","v":{"$error":"#DIV/0!"}},{"$f":"(BL48*BH48)/((1-BH48)*-BM48)","v":{"$error":"#DIV/0!"}},0,0,{"$f":"(BQ48*AR48)-((1-AR48)*-BR48)","v":{"$error":"#DIV/0!"}},{"$f":"BQ48/-BR48","v":{"$error":"#DIV/0!"}},{"$f":"(BQ48*AR48)/((1-AR48)*-BR48)","v":{"$error":"#DIV/0!"}},0,0,{"$f":"(BV48*BA48)-((1-BA48)*-BW48)","v":{"$error":"#DIV/0!"}},{"$f":"BV48/-BW48","v":{"$error":"#DIV/0!"}},{"$f":"(BV48*BA48)/((1-BA48)*-BW48)","v":{"$error":"#DIV/0!"}}]
[null,34,"","","","","","",null,"","","","","",null,"","","","","",{"$nulls":5},{"$error":"#NUM!"},{"$error":"#NUM!"},{"$error":"#NUM!"},{"$error":"#NUM!"},{"$error":"#NUM!"},{"$nulls":4},{"$f":"SMALL('TRADE LOG'!$AQ$15:$AQ$9733,'TRADE LOG'!B48)","v":{"$error":"#NUM!"}},"",0,0,0,0,null,0,0,{"$error":"#DIV/0!"},{"$error":"#DIV/0!"},0,0,0,0,null,0,0,{"$error":"#DIV/0!"},{"$error":"#DIV/0!"},0,0,{"$f":"IF(AJ49=\"\",\"\",BD49+BC49+'TRADE LOG'!AR48)","v":""},0,0,{"$error":"#DIV/0!"},{"$error":"#DIV/0!"},0,{"$error":"#VALUE!"},{"$error":"#DIV/0!"},{"$error":"#DIV/0!"},{"$error":"#DIV/0!"},{"$error":"#DIV/0!"},{"$error":"#DIV/0!"},0,0,{"$error":"#DIV/0!"},{"$error":"#DIV/0!"},{"$error":"#DIV/0!"},0,0,{"$error":"#DIV/0!"},{"$error":"#DIV/0!"},{"$error":"#DIV/0!"}]
[null,35,"","","","","","",null,"","","","","",null,"","","","","",{"$nulls":5},{"$error":"#NUM!"},{"$error":"#NUM!"},{"$error":"#NUM!"},{"$error":"#NUM!"},{"$error":"#NUM!"},{"$nulls":4},{"$f":"SMALL('TRADE LOG'!$AQ$15:$AQ$9733,'TRADE LOG'!B49)","v":{"$error":"#NUM!"}},"",0,0,0,0,null,0,0,{"$error":"#DIV/0!"},{"$error":"#DIV/0!"},0,0,0,0,null,0,0,{"$error":"#DIV/0!"},{"$error":"#DIV/0!"},0,0,{"$f":"IF(AJ50=\"\",\"\",BD50+BC50+'TRADE LOG'!AR49)","v":""},0,0,{"$error":"#DIV/0!"},{"$error":"#DIV/0!"},0,{"$error":"#VALUE!"},{"$error":"#DIV/0!"},{"$error":"#DIV/0!"},{"$error":"#DIV/0!"},{"$error":"#DIV/0!"},{"$error":"#DIV/0!"},0,0,{"$error":"#DIV/0!"},{"$error":"#DIV/0!"},{"$error":"#DIV/0!"},0,0,{"$error":"#DIV/0!"},{"$error":"#DIV/0!"},{"$error":"#DIV/0!"}]
[null,36,"","","","","","",null,"","","","","",null,"","","","","",{"$nulls":5},{"$error":"#NUM!"},{"$error":"#NUM!"},{"$error":"#NUM!"},{"$error":"#NUM!"},{"$error":"#NUM!"},{"$nulls":4},{"$f":"SMALL('TRADE LOG'!$AQ$15:$AQ$9733,'TRADE LOG'!B50)","v":{"$error":"#NUM!"}},"",0,0,0,0,null,0,0,{"$error":"#DIV/0!"},{"$error":"#DIV/0!"},0,0,0,0,null,0,0,{"$error":"#DIV/0!"},{"$error":"#DIV/0!"},0,0,{"$f":"IF(AJ51=\"\",\"\",BD51+BC51+'TRADE LOG'!AR50)","v":""},0,0,{"$error":"#DIV/0!"},{"$error":"#DIV/0!"},0,{"$error":"#VALUE!"},{"$error":"#DIV/0!"},{"$error":"#DIV/0!"},{"$error":"#DIV/0!"},{"$error":"#DIV/0!"},{"$error":"#DIV/0!"},0,0,{"$error":"#DIV/0!"},{"$error":"#DIV/0!"},{"$error":"#DIV/0!"},0,0,{"$error":"#DIV/0!"},{"$error":"#DIV/0!"},{"$error":"#DIV/0!"}]
[null,37,"","","","","","",null,"","","","","",null,"","","","","",{"$nulls":5},{"$error":"#NUM!"},{"$error":"#NUM!"},{"$error":"#NUM!"},{"$error":"#NUM!"},{"$error":"#NUM!"},{"$nulls":4},{"$f":"SMALL('TRADE LOG'!$AQ$15:$AQ$9733,'TRADE LOG'!B51)","v":{"$error":"#NUM!"}},"",0,0,0,0,null,0,0,{"$error":"#DIV/0!"},{"$error":"#DIV/0!"},0,0,0,0,null,0,0,{"$error":"#DIV/0!"},{"$error":"#DIV/0!"},0,0,{"$f":"IF(AJ52=\"\",\"\",BD52+BC52+'TRADE LOG'!AR51)","v":""},0,0,{"$error":"#DIV/0!"},{"$error":"#DIV/0!"},0,{"$error":"#VALUE!"},{"$error":"#DIV/0!"},{"$error":"#DIV/0!"},{"$error":"#DIV/0!"},{"$error":"#DIV/0!"},{"$error":"#DIV/0!"},0,0,{"$error":"#DIV/0!"},{"$error":"#DIV/0!"},{"$error":"#DIV/0!"},0,0,{"$error":"#DIV/0!"},{"$error":"#DIV/0!"},{"$error":"#DIV/0!"}]
[null,38,"","","","","","",null,"","","","","",null,"","","","","",{"$nulls":5},{"$error":"#NUM!"},{"$error":"#NUM!"},{"$error":"#NUM!"},{"$error":"#NUM!"},{"$error":"#NUM!"},{"$nulls":4},{"$f":"SMALL('TRADE LOG'!$AQ$15:$AQ$9733,'TRADE LOG'!B52)","v":{"$error":"#NUM!"}},"",0,0,0,0,null,0,0,{"$error":"#DIV/0!"},{"$error":"#DIV/0!"},0,0,0,0,null,0,0,{"$error":"#DIV/0!"},{"$error":"#DIV/0!"},0,0,{"$f":"IF(AJ53=\"\",\"\",BD53+BC53+'TRADE LOG'!AR52)","v":""},0,0,{"$error":"#DIV/0!"},{"$error":"#DIV/0!"},0,{"$error":"#VALUE!"},{"$error":"#DIV/0!"},{"$error":"#DIV/0!"},{"$error":"#DIV/0!"},{"$error":"#DIV/0!"},{"$error":"#DIV/0!"},0,0,{"$error":"#DIV/0!"},{"$error":"#DIV/0!"},{"$error":"#DIV/0!"},0,0,{"$error":"#DIV/0!"},{"$error":"#DIV/0!"},{"$error":"#DIV/0!"}]
[null,39,"","","","","","",null,"","","","","",null,"","","","","",{"$nulls":5},{"$error":"#NUM!"},{"$error":"#NUM!"},{"$error":"#NUM!"},{"$error":"#NUM!"},{"$error":"#NUM!"},{"$nulls":4},{"$f":"SMALL('TRADE LOG'!$AQ$15:$AQ$9733,'TRADE LOG'!B53)","v":{"$error":"#NUM!"}},"",0,0,0,0,null,0,0,{"$error":"#DIV/0!"},{"$error":"#DIV/0!"},0,0,0,0,null,0,0,{"$error":"#DIV/0!"},{"$error":"#DIV/0!"},0,0,{"$f":"IF(AJ54=\"\",\"\",BD54+BC54+'TRADE LOG'!AR53)","v":""},0,0,{"$error":"#DIV/0!"},{"$error":"#DIV/0!"},0,{"$error":"#VALUE!"},{"$error":"#DIV/0!"},{"$error":"#DIV/0!"},{"$error":"#DIV/0!"},{"$error":"#DIV/0!"},{"$error":"#DIV/0!"},0,0,{"$error":"#DIV/0!"},{"$error":"#DIV/0!"},{"$error":"#DIV/0!"},0,0,{"$error":"#DIV/0!"},{"$error":"#DIV/0!"},{"$error":"#DIV/0!"}]
[null,40,"","","","","","",null,"","","","","",null,"","","","","",{"$nulls":5},{"$error":"#NUM!"},{"$error":"#NUM!"},{"$error":"#NUM!"},{"$error":"#NUM!"},{"$error":"#NUM!"},{"$nulls":4},{"$f":"SMALL('TRADE LOG'!$AQ$15:$AQ$9733,'TRADE LOG'!B54)","v":{"$error":"#NUM!"}},"",0,0,0,0,null,0,0,{"$error":"#DIV/0!"},{"$error":"#DIV/0!"},0,0,0,0,null,0,0,{"$error":"#DIV/0!"},{"$error":"#DIV/0!"},0,0,{"$f":"IF(AJ55=\"\",\"\",BD55+BC55+'TRADE LOG'!AR54)","v":""},0,0,{"$error":"#DIV/0!"},{"$error":"#DIV/0!"},0,{"$error":"#VALUE!"},{"$error":"#DIV/0!"},{"$error":"#DIV/0!"},{"$error":"#DIV/0!"},{"$error":"#DIV/0!"},{"$error":"#DIV/0!"},0,0,{"$error":"#DIV/0!"},{"$error":"#DIV/0!"},{"$error":"#DIV/0!"},0,0,{"$error":"#DIV/0!"},{"$error":"#DIV/0!"},{"$error":"#DIV/0!"}]
[null,41,"","","","","","",null,"","","","","",null,"","","","","",{"$nulls":5},{"$error":"#NUM!"},{"$error":"#NUM!"},{"$error":"#NUM!"},{"$error":"#NUM!"},{"$error":"#NUM!"},{"$nulls":4},{"$f":"SMALL('TRADE LOG'!$AQ$15:$AQ$9733,'TRADE LOG'!B55)","v":{"$error":"#NUM!"}},"",0,0,0,0,null,0,0,{"$error":"#DIV/0!"},{"$error":"#DIV/0!"},0,0,0,0,null,0,0,{"$error":"#DIV/0!"},{"$error":"#DIV/0!"},0,0,{"$f":"IF(AJ56=\"\",\"\",BD56+BC56+'TRADE LOG'!AR55)","v":""},0,0,{"$error":"#DIV/0!"},{"$error":"#DIV/0!"},0,{"$error":"#VALUE!"},{"$error":"#DIV/0!"},{"$error":"#DIV/0!"},{"$error":"#DIV/0!"},{"$error":"#DIV/0!"},{"$error":"#DIV/0!"},0,0,{"$error":"#DIV/0!"},{"$error":"#DIV/0!"},{"$error":"#DIV/0!"},0,0,{"$error":"#DIV/0!"},{"$error":"#DIV/0!"},{"$error":"#DIV/0!"}]
[null,42,"","","","","","",null,"","","","","",null,"","","","","",{"$nulls":5},{"$error":"#NUM!"},{"$error":"#NUM!"},{"$error":"#NUM!"},{"$error":"#NUM!"},{"$error":"#NUM!"},{"$nulls":4},{"$f":"SMALL('TRADE LOG'!$AQ$15:$AQ$9733,'TRADE LOG'!B56)","v":{"$error":"#NUM!"}},"",0,0,0,0,null,0,0,{"$error":"#DIV/0!"},{"$error":"#DIV/0!"},0,0,0,0,null,0,0,{"$error":"#DIV/0!"},{"$error":"#DIV/0!"},0,0,{"$f":"IF(AJ57=\"\",\"\",BD57+BC57+'TRADE LOG'!AR56)","v":""},0,0,{"$error":"#DIV/0!"},{"$error":"#DIV/0!"},0,{"$error":"#VALUE!"},{"$error":"#DIV/0!"},{"$error":"#DIV/0!"},{"$error":"#DIV/0!"},{"$error":"#DIV/0!"},{"$error":"#DIV/0!"},0,0,{"$error":"#DIV/0!"},{"$error":"#DIV/0!"},{"$error":"#DIV/0!"},0,0,{"$error":"#DIV/0!"},{"$error":"#DIV/0!"},{"$error":"#DIV/0!"}]
[null,43,"","","","","","",null,"","","","","",null,"","","","","",{"$nulls":5},{"$error":"#NUM!"},{"$error":"#NUM!"},{"$error":"#NUM!"},{"$error":"#NUM!"},{"$error":"#NUM!"},{"$nulls":4},{"$f":"SMALL('TRADE LOG'!$AQ$15:$AQ$9733,'TRADE LOG'!B57)","v":{"$error":"#NUM!"}},"",0,0,0,0,null,0,0,{"$error":"#DIV/0!"},{"$error":"#DIV/0!"},0,0,0,0,null,0,0,{"$error":"#DIV/0!"},{"$error":"#DIV/0!"},0,0,{"$f":"IF(AJ58=\"\",\"\",BD58+BC58+'TRADE LOG'!AR57)","v":""},0,0,{"$error":"#DIV/0!"},{"$error":"#DIV/0!"},0,{"$error":"#VALUE!"},{"$error":"#DIV/0!"},{"$error":"#DIV/0!"},{"$error":"#DIV/0!"},{"$error":"#DIV/0!"},{"$error":"#DIV/0!"},0,0,{"$error":"#DIV/0!"},{"$error":"#DIV/0!"},{"$error":"#DIV/0!"},0,0,{"$error":"#DIV/0!"},{"$error":"#DIV/0!"},{"$error":"#DIV/0!"}]
[null,44,"","","","","","",null,"","","","","",null,"","","","","",{"$nulls":5},{"$error":"#NUM!"},{"$error":"#NUM!"},{"$error":"#NUM!"},{"$error":"#NUM!"},{"$error":"#NUM!"},{"$nulls":4},{"$f":"SMALL('TRADE LOG'!$AQ$15:$AQ$9733,'TRADE LOG'!B58)","v":{"$error":"#NUM!"}},"",0,0,0,0,null,0,0,{"$error":"#DIV/0!"},{"$error":"#DIV/0!"},0,0,0,0,null,0,0,{"$error":"#DIV/0!"},{"$error":"#DIV/0!"},0,0,{"$f":"IF(AJ59=\"\",\"\",BD59+BC59+'TRADE LOG'!AR58)","v":""},0,0,{"$error":"#DIV/0!"},{"$error":"#DIV/0!"},0,{"$error":"#VALUE!"},{"$error":"#DIV/0!"},{"$error":"#DIV/0!"},{"$error":"#DIV/0!"},{"$error":"#DIV/0!"},{"$error":"#DIV/0!"},0,0,{"$error":"#DIV/0!"},{"$error":"#DIV/0!"},{"$error":"#DIV/0!"},0,0,{"$error":"#DIV/0!"},{"$error":"#DIV/0!"},{"$error":"#DIV/0!"}]
[null,45,"","","","","","",null,"","","","","",null,"","","","","",{"$nulls":5},{"$error":"#NUM!"},{"$error":"#NUM!"},{"$error":"#NUM!"},{"$error":"#NUM!"},{"$error":"#NUM!"},{"$nulls":4},{"$f":"SMALL('TRADE LOG'!$AQ$15:$AQ$9733,'TRADE LOG'!B59)","v":{"$error":"#NUM!"}},"",0,0,0,0,null,0,0,{"$error":"#DIV/0!"},{"$error":"#DIV/0!"},0,0,0,0,null,0,0,{"$error":"#DIV/0!"},{"$error":"#DIV/0!"},0,0,{"$f":"IF(AJ60=\"\",\"\",BD60+BC60+'TRADE LOG'!AR59)","v":""},0,0,{"$error":"#DIV/0!"},{"$error":"#DIV/0!"},0,{"$error":"#VALUE!"},{"$error":"#DIV/0!"},{"$error":"#DIV/0!"},{"$error":"#DIV/0!"},{"$error":"#DIV/0!"},{"$error":"#DIV/0!"},0,0,{"$error":"#DIV/0!"},{"$error":"#DIV/0!"},{"$error":"#DIV/0!"},0,0,{"$error":"#DIV/0!"},{"$error":"#DIV/0!"},{"$error":"#DIV/0!"}]
[null,46,"","","","","","",null,"","","","","",null,"","","","","",{"$nulls":5},{"$error":"#NUM!"},{"$error":"#NUM!"},{"$error":"#NUM!"},{"$error":"#NUM!"},{"$error":"#NUM!"},{"$nulls":4},{"$f":"SMALL('TRADE LOG'!$AQ$15:$AQ$9733,'TRADE LOG'!B60)","v":{"$error":"#NUM!"}},"",0,0,0,0,null,0,0,{"$error":"#DIV/0!"},{"$error":"#DIV/0!"},0,0,0,0,null,0,0,{"$error":"#DIV/0!"},{"$error":"#DIV/0!"},0,0,{"$f":"IF(AJ61=\"\",\"\",BD61+BC61+'TRADE LOG'!AR60)","v":""},0,0,{"$error":"#DIV/0!"},{"$error":"#DIV/0!"},0,{"$error":"#VALUE!"},{"$error":"#DIV/0!"},{"$error":"#DIV/0!"},{"$error":"#DIV/0!"},{"$error":"#DIV/0!"},{"$error":"#DIV/0!"},0,0,{"$error":"#DIV/0!"},{"$error":"#DIV/0!"},{"$error":"#DIV/0!"},0,0,{"$error":"#DIV/0!"},{"$error":"#DIV/0!"},{"$error":"#DIV/0!"}]
[null,47,"","","","","","",null,"","","","","",null,"","","","","",{"$nulls":5},{"$error":"#NUM!"},{"$error":"#NUM!"},{"$error":"#NUM!"},{"$error":"#NUM!"},{"$error":"#NUM!"},{"$nulls":4},{"$f":"SMALL('TRADE LOG'!$AQ$15:$AQ$9733,'TRADE LOG'!B61)","v":{"$error":"#NUM!"}},"",0,0,0,0,null,0,0,{"$error":"#DIV/0!"},{"$error":"#DIV/0!"},0,0,0,0,null,0,0,{"$error":"#DIV/0!"},{"$error":"#DIV/0!"},0,0,{"$f":"IF(AJ62=\"\",\"\",BD62+BC62+'TRADE LOG'!AR61)","v":""},0,0,{"$error":"#DIV/0!"},{"$error":"#DIV/0!"},0,{"$error":"#VALUE!"},{"$error":"#DIV/0!"},{"$error":"#DIV/0!"},{"$error":"#DIV/0!"},{"$error":"#DIV/0!"},{"$error":"#DIV/0!"},0,0,{"$error":"#DIV/0!"},{"$error":"#DIV/0!"},{"$error":"#DIV/0!"},0,0,{"$error":"#DIV/0!"},{"$error":"#DIV/0!"},{"$error":"#DIV/0!"}]
[null,48,"","","","","","",null,"","","","","",null,"","","","","",{"$nulls":5},{"$error":"#NUM!"},{"$error":"#NUM!"},{"$error":"#NUM!"},{"$error":"#NUM!"},{"$error":"#NUM!"},{"$nulls":4},{"$f":"SMALL('TRADE LOG'!$AQ$15:$AQ$9733,'TRADE LOG'!B62)","v":{"$error":"#NUM!"}},"",0,0,0,0,null,0,0,{"$error":"#DIV/0!"},{"$error":"#DIV/0!"},0,0,0,0,null,0,0,{"$error":"#DIV/0!"},{"$error":"#DIV/0!"},0,0,{"$f":"IF(AJ63=\"\",\"\",BD63+BC63+'TRADE LOG'!AR62)","v":""},0,0,{"$error":"#DIV/0!"},{"$error":"#DIV/0!"},0,{"$error":"#VALUE!"},{"$error":"#DIV/0!"},{"$error":"#DIV/0!"},{"$error":"#DIV/0!"},{"$error":"#DIV/0!"},{"$error":"#DIV/0!"},0,0,{"$error":"#DIV/0!"},{"$error":"#DIV/0!"},{"$error":"#DIV/0!"},0,0,{"$error":"#DIV/0!"},{"$error":"#DIV/0!"},{"$error":"#DIV/0!"}]
[null,49,"","","","","","",null,"","","","","",null,"","","","","",{"$nulls":5},{"$error":"#NUM!"},{"$error":"#NUM!"},{"$error":"#NUM!"},{"$error":"#NUM!"},{"$error":"#NUM!"},{"$nulls":4},{"$f":"SMALL('TRADE LOG'!$AQ$15:$AQ$9733,'TRADE LOG'!B63)","v":{"$error":"#NUM!"}},"",0,0,0,0,null,0,0,{"$error":"#DIV/0!"},{"$error":"#DIV/0!"},0,0,0,0,null,0,0,{"$error":"#DIV/0!"},{"$error":"#DIV/0!"},0,0,{"$f":"IF(AJ64=\"\",\"\",BD64+BC64+'TRADE LOG'!AR63)","v":""},0,0,{"$error":"#DIV/0!"},{"$error":"#DIV/0!"},0,{"$error":"#VALUE!"},{"$error":"#DIV/0!"},{"$error":"#DIV/0!"},{"$error":"#DIV/0!"},{"$error":"#DIV/0!"},{"$error":"#DIV/0!"},0,0,{"$error":"#DIV/0!"},{"$error":"#DIV/0!"},{"$error":"#DIV/0!"},0,0,{"$error":"#DIV/0!"},{"$error":"#DIV/0!"},{"$error":"#DIV/0!"}]
[null,50,"","","","","","",null,"","","","","",null,"","","","","",{"$nulls":5},{"$error":"#NUM!"},{"$error":"#NUM!"},{"$error":"#NUM!"},{"$error":"#NUM!"},{"$error":"#NUM!"},{"$nulls":4},{"$f":"SMALL('TRADE LOG'!$AQ$15:$AQ$9733,'TRADE LOG'!B64)","v":{"$error":"#NUM!"}},"",0,0,0,0,null,0,0,{"$error":"#DIV/0!"},{"$error":"#DIV/0!"},0,0,0,0,null,0,0,{"$error":"#DIV/0!"},{"$error":"#DIV/0!"},0,0,{"$f":"IF(AJ65=\"\",\"\",BD65+BC65+'TRADE LOG'!AR64)","v":""},0,0,{"$error":"#DIV/0!"},{"$error":"#DIV/0!"},0,{"$error":"#VALUE!"},{"$error":"#DIV/0!"},{"$error":"#DIV/0!"},{"$error":"#DIV/0!"},{"$error":"#DIV/0!"},{"$error":"#DIV/0!"},0,0,{"$error":"#DIV/0!"},{"$error":"#DIV/0!"},{"$error":"#DIV/0!"},0,0,{"$error":"#DIV/0!"},{"$error":"#DIV/0!"},{"$error":"#DIV/0!"}]
[{"$nulls":3},{"$f":"IFERROR(P66+J66,\"\")","v":""},"",null,"","",null,{"$f":"IFERROR(AC66,\"\")","v":""},"","","","",null,{"$f":"IFERROR(AD66,\"\")","v":""},"","","","",{"$nulls":5},{"$error":"#NUM!"},{"$error":"#NUM!"},{"$error":"#NUM!"},{"$error":"#NUM!"},{"$error":"#NUM!"},{"$nulls":4},{"$f":"SMALL('TRADE LOG'!$AQ$15:$AQ$9733,'TRADE LOG'!B65)","v":{"$error":"#NUM!"}},"",0,0,0,0,null,0,0,{"$error":"#DIV/0!"},{"$error":"#DIV/0!"},0,0,0,0,{"$f":"AW66/AT66","v":{"$error":"#DIV/0!"}},0,0,{"$error":"#DIV/0!"},{"$error":"#DIV/0!"},0,0,{"$f":"IF(AJ66=\"\",\"\",BD66+BC66+'TRADE LOG'!AR65)","v":""},0,0,{"$error":"#DIV/0!"},{"$error":"#DIV/0!"},0,{"$error":"#VALUE!"},{"$error":"#DIV/0!"},{"$error":"#DIV/0!"},{"$error":"#DIV/0!"},{"$error":"#DIV/0!"},{"$error":"#DIV/0!"},0,0,{"$error":"#DIV/0!"},{"$error":"#DIV/0!"},{"$error":"#DIV/0!"},0,0,{"$error":"#DIV/0!"},{"$error":"#DIV/0!"},{"$error":"#DIV/0!"}]

{"sheet":"MONTHLY REPORT","index":6,"n_rows":90,"n_cols":52,"rows_kept":90,"hidden":true}
[null,"  MONTHLY REPORT",{"$nulls":21},{"$f":"SETTINGS!AA13","v":"REWARD-RISK RATIO"},{"$f":"\"WIN% VS \"&X1","v":"WIN% VS REWARD-RISK RATIO"},{"$nulls":25},"Win rate%","RRR"]
[]
[{"$nulls":23},{"$f":"SETTINGS!AH2","v":"2023-03-17"},{"$nulls":14},{"$f":"CONCATENATE(TEXT(AM4,\"  0.0% \"),\"to Breakeven\")","v":"  39.5% to Breakeven"},"full","Win Rate%","Ave.Gain%","Ave.Loss%","RRR",null,"Edge",null,"Ratio",{"$nulls":3},"Adj. RRR"]
[{"$nulls":23},{"$f":"DATE(YEAR(X3),MONTH(X3),DAY(1))","v":"2023-03-01"},{"$f":"IF(SETTINGS!L20=\"Archived\",\"Archived\",X4)","v":44986},{"$nulls":12},{"$f":"S2O","v":"2023-03-01"},{"$f":"1/(1+(AV4/1))","v":{"v":0.39494497543680873,"d":"39%"}},{"$f":"IF(AM4>0,100%)","v":{"v":1,"d":"100%"}},{"$f":"AK15","v":{"v":0.45454545454545453,"d":"45%"}},{"$f":"AP15","v":{"v":0.06820304474998616,"d":"7%"}},{"$f":"-AQ15","v":{"v":0.04451900858594662,"d":"4%"}},{"$f":"AP4/AQ4","v":{"v":1.5319982837963717,"d":"1.532"}},null,{"$f":"AT15/AU15","v":{"$error":"#DIV/0!"}},null,{"$f":"IF($X$1=$AB$8,AR4,AT4)","v":{"v":1.5319982837963717,"d":"1.53"}},{"$nulls":3},"Edge Ratio"]
[{"$nulls":23},{"$f":"MIN('TRADE LOG'!C15:C1749)","v":"2020-05-26T05:48:19"},{"$f":"HOME!U6","v":0},{"$nulls":4},"net profit","net loss",{"$nulls":6},{"$f":"X16","v":"2023-02-01"},{"v":0.39494497543680873,"d":"39%"},{"$f":"IF(AM5>0,100%)","v":{"v":1,"d":"100%"}},{"v":0.45454545454545453,"d":"45%"},{"v":0.06820304474998616,"d":"7%"},{"v":0.04451900858594662,"d":"4%"},{"v":1.5319982837963717,"d":"1.532"},null,{"$error":"#DIV/0!"},null,{"$f":"IF($X$1=$AB$8,AR5,AT5)","v":{"v":1.5319982837963717,"d":"1.53"}},{"$nulls":3},"Profit Factor"]
[{"$nulls":23},{"$f":"MIN('Bank Transfers'!D15:D1000)","v":"2020-05-26T05:48:19"},{"$nulls":5},{"$f":"SUMIFS('TRADE LOG'!$BD$15:$BD$9733,'TRADE LOG'!$BK$15:$BK$9733,1)","v":13805.110000000002},{"$f":"SUMIFS('TRADE LOG'!$BD$15:$BD$9733,'TRADE LOG'!$BK$15:$BK$9733,-1,'TRADE LOG'!$BC$15:$BC$9733,0)","v":-9533.689999999997},{"$nulls":6},{"$f":"X17","v":"2023-01-01"},{"v":0.39494497543680873,"d":"39%"},{"v":1,"d":"100%"},{"v":0.45454545454545453,"d":"45%"},{"v":0.06820304474998616,"d":"7%"},{"v":0.04451900858594662,"d":"4%"},{"v":1.5319982837963717,"d":"1.532"},null,{"$error":"#DIV/0!"},null,{"v":1.5319982837963717,"d":"1.53"}]
[{"$nulls":23},{"$f":"IF(OR(MIN(X5:X6)=0,COUNT(S2O)=0),SETTINGS!#REF!,MIN(X5:X6))","v":"2020-05-26T05:48:19"},{"$f":"DATE(YEAR(X7),MONTH(X7),DAY(1))","v":43952},{"$nulls":4},{"$f":"AD6/-AE6","v":1.4480342868291298},{"$nulls":7},{"$f":"X18","v":"2022-12-01"},{"v":0.39494497543680873,"d":"39%"},{"v":1,"d":"100%"},{"v":0.45454545454545453,"d":"45%"},{"v":0.06820304474998616,"d":"7%"},{"v":0.04451900858594662,"d":"4%"},{"v":1.5319982837963717,"d":"1.532"},null,{"$error":"#DIV/0!"},null,{"v":1.5319982837963717,"d":"1.53"}]
[{"$nulls":27},"REWARD-RISK RATIO",{"$nulls":4},"Average Win% / Average Loss%",{"$nulls":4},{"$f":"X19","v":"2022-11-01"},{"v":0.39494497543680873,"d":"39%"},{"v":1,"d":"100%"},{"v":0.45454545454545453,"d":"45%"},{"v":0.06820304474998616,"d":"7%"},{"v":0.04451900858594662,"d":"4%"},{"v":1.5319982837963717,"d":"1.532"},null,{"$error":"#DIV/0!"},null,{"v":1.5319982837963717,"d":"1.53"}]
[{"$nulls":27},"PROFIT-LOSS RATIO",null,null,{"$f":"AL15/AG15","v":{"$error":"#DIV/0!"}},{"$nulls":6},{"$f":"X20","v":"2022-10-01"},{"v":0.39494497543680873,"d":"39%"},{"v":1,"d":"100%"},{"v":0.45454545454545453,"d":"45%"},{"v":0.06820304474998616,"d":"7%"},{"v":0.04451900858594662,"d":"4%"},{"v":1.5319982837963717,"d":"1.53"},null,{"$error":"#DIV/0!"},null,{"v":1.5319982837963717,"d":"1.53"}]
[{"$nulls":23},{"$f":"SETTINGS!S3","v":0.01},{"$nulls":6},{"$f":"AL16/AG16","v":{"$error":"#DIV/0!"}}]
[{"$nulls":23},{"$f":"SUMIFS(ProfitLoss,ProfitLoss,\">0\",Datelog,\">0\",'TRADE LOG'!$Q$15:$Q$9733,\">0\")","v":13805.110000000002},{"$nulls":26},"vol axis","equity axis"]
[{"$nulls":45},"cum",{"$nulls":4},{"$f":"MAX(AA15:AA50)*1.5","v":6671169.143475551},{"$f":"MAX(J15:J50)*1.1","v":59698.56200000001}]
[null,"MONTH","Additional \nDeposits","Withdrawals","BEG. BALANCE","FUND TRANSFER","GROSS PROFIT","GROSS LOSS","TAX & FEES","END BALANCE","NET PROFIT","% P&L",null,"TRADES","WIN RATE%","AVE.WIN%","AVE.LOSS%","RRR","EDGE RATIO","P-FACTOR","NET R-MUL",{"$nulls":6},"equity chart",null,"historical win rate%","col chart","monthly","win trade","loss","cum.w","cum.l","cum.win%","%win sum","%loss sum","cumulative W%","Cumulative L%","Cum.ave.Win%","Cum.ave.loss%","cum.profit","cu.loss","ave.profit","ave.loss","ave.profit","ave.loss",null,{"$f":"MIN(AA15:AA50)*0.8","v":0},{"$f":"LARGE(J15:J50,COUNT(U15:U50))*0.8","v":0}]
[null,"TOTAL",{"$f":"SUMIFS('Bank Transfers'!H15:H514,'Bank Transfers'!E15:E514,\"deposit\")","v":50000},{"$f":"SUMIFS('Bank Transfers'!H15:H514,'Bank Transfers'!E15:E514,\"Withdraw\",'Bank Transfers'!D15:D514,\">0\")","v":0},{"$f":"'TRADE LOG'!T15","v":{"v":50000,"d":"$50,000.0"}},{"$f":"SUM(F15:F50)","v":0},{"$f":"SUMIFS('TRADE LOG'!$M$15:$M$9733,WL,\"W\")","v":{"v":16146.939999999999,"d":"$16,146.9"}},{"$f":"SUMIFS('TRADE LOG'!$M$15:$M$9733,WL,\"L\")","v":{"v":-6914.68,"d":"$-6,914.7"}},{"$f":"SUM(Fees)","v":{"v":-4960.840000000001,"d":"$-4,960.8"}},{"$f":"SUM(E14:I14)","v":{"v":54271.42,"d":"$54,271.4"}},{"$f":"G14+H14+I14","v":{"v":4271.419999999997,"d":"$4,271.4"}},{"$f":"IFERROR(K14/(E14),0)","v":{"v":0.08542839999999995,"d":"▲ 8.54%"}},null,{"$f":"'TRADE STATISTICS'!BI4+'TRADE STATISTICS'!BJ4","v":55},{"$f":"'TRADE STATISTICS'!BI6","v":{"v":0.45454545454545453,"d":"45.5%"}},{"$f":"DASHBOARD!I37","v":{"v":0.06820304474998616,"d":"6.8%"}},{"$f":"DASHBOARD!I38","v":{"v":-0.04451900858594662,"d":"-4.5%"}},{"$f":"IFERROR(P14/-Q14,\"\")","v":{"v":1.5319982837963717,"d":"1.5"}},{"$f":"'TRADE STATISTICS'!BL8","v":{"v":1.7376411441949557,"d":"1.7"}},{"$f":"'TRADE STATISTICS'!BJ9","v":{"v":1.4480342868291298,"d":"1.4"}},{"$f":"IFERROR(K14/((E14+F14)*X10),0)","v":{"v":8.542839999999995,"d":"8.54R"}},null,null,"Month",null,"Month","Volume","vol positive","vol.neg","increase %","decrease%","win%",{"$f":"'TRADE STATISTICS'!BI4","v":25},{"$f":"'TRADE STATISTICS'!BJ4","v":30},{"$nulls":3},{"$f":"SUMIFS(PNLPercent,WL,\"W\")","v":1.705076118749654},{"$f":"SUMIFS(PNLPercent,WL,\"L\")","v":-1.3355702575783988},{"$nulls":4},{"$f":"AD6","v":13805.110000000002},{"$f":"AE6","v":-9533.689999999997},{"$nulls":4},"NET PROFIT","NET LOSS"]
[1,{"$f":"IFERROR(IF(COUNT(X15)=0,S2O,IF(IF(X15<=$X$4,X15,\"\")<$Y$7,\"\",IF(X15<=$X$4,X15,\"\"))),\"\")","v":"2023-03-01"},{"$f":"SUMIFS('Bank Transfers'!$H$15:$H$514,'Bank Transfers'!$L$15:$L$514,B15,'Bank Transfers'!$E$15:$E$514,\"deposit\")","v":0},{"$f":"SUMIFS('Bank Transfers'!$H$15:$H$514,'Bank Transfers'!$L$15:$L$514,B15,'Bank Transfers'!$E$15:$E$514,\"withdraw\")","v":0},{"$f":"IF(B15=\"\",\"\",IF(B15='Bank Transfers'!$L$15,'Bank Transfers'!$H$15,J16))","v":{"v":54271.420000000006,"d":"$54,271.4"}},{"$f":"IFERROR(IF(B15='Bank Transfers'!$L$15,C15+D15-E15,C15+D15),0)","v":0},{"$f":"SUMIFS('TRADE LOG'!$M$15:$M$9733,WL,\"W\",datecode,B15)","v":0},{"$f":"SUMIFS('TRADE LOG'!$M$15:$M$9733,WL,\"L\",datecode,B15)","v":0},{"$f":"SUMIFS(Fees,datecode,B15)","v":0},{"$f":"IFERROR(IF(B15=\"\",0,SUM(E15:I15)),\"\")","v":{"v":54271.420000000006,"d":"$54,271.4"}},{"$f":"IFERROR(G15+H15+I15,\"\")","v":0},{"$f":"IFERROR(K15/IF(AND(B15<>\"\",E15<=0),F15,E15),\"\")","v":0},null,{"$f":"IF(E15=\"\",\"\",AG15+AH15)","v":0},{"$f":"IFERROR(AG15/(AG15+AH15),\"\")","v":""},{"$f":"IFERROR(SUMIFS(PNLPercent,WL,\"W\",datecode,B15)/AG15,\"\")","v":""},{"$f":"IFERROR(SUMIFS('TRADE LOG'!$BE$15:$BE$9733,'TRADE LOG'!$BK$15:$BK$9733,-1,datecode,B15)/AH15,\"\")","v":""},{"$f":"IFERROR(P15/-Q15,\"\")","v":""},{"$f":"IFERROR(AV15/AW15,\"\")","v":""},{"$f":"IFERROR((AV15*AF15)/(AW15*(1-AF15)),\"\")","v":""},{"$f":"IFERROR(SUMIFS('TRADE LOG'!$W$15:$W$9733,datecode,\"=\"&B15),\"\")","v":{"v":0,"d":"0.00R"}},null,null,{"$f":"IFERROR(IF(Nameko=SheetlU13,M2O,Y5),Y5)","v":44986},{"$f":"IF(J15=0,NA(),J15)","v":54271.420000000006},{"$f":"B15","v":44986},{"$f":"SUMIFS(BuyAmount,datecode,\"=\"&'MONTHLY REPORT'!B15)","v":0},{"$f":"IF(L15>0,AA15,0)","v":0},{"$f":"AA15-AB15","v":0},{"$f":"IF(O15>O16,O15,0)","v":0},{"$f":"O15-AD15","v":{"$error":"#VALUE!"}},{"$f":"O15","v":""},{"$f":"COUNTIFS(WL,\"W\",datecode,B15)","v":0},{"$f":"COUNTIFS(WL,\"L\",datecode,B15)","v":0},{"$f":"AG14","v":25},{"$f":"AH14","v":30},{"$f":"IFERROR(AI15/(AI15+AJ15),NA())","v":0.45454545454545453},{"$f":"SUMIFS(PNLPercent,WL,\"W\",datecode,B15)","v":0},{"$f":"SUMIFS(PNLPercent,WL,\"L\",datecode,B15)","v":0},{"$f":"AL14","v":1.705076118749654},{"$f":"AM14","v":-1.3355702575783988},{"$f":"IFERROR(AN15/AI15,0)","v":0.06820304474998616},{"$f":"IFERROR(AO15/AJ15,0)","v":-0.04451900858594662},{"$f":"AX15+AR16","v":0},{"$f":"AY15+AS16","v":0},{"$f":"AR15/AI15","v":0},{"$f":"-AS15/AJ15","v":0},{"$f":"AX15/AG15","v":{"$error":"#DIV/0!"}},{"$f":"-AY15/AH15","v":{"$error":"#DIV/0!"}},{"$f":"SUMIFS(PNLwFees,WL,\"W\",datecode,B15)","v":0},{"$f":"SUMIFS(PNLwFees,WL,\"L\",datecode,B15)","v":0}]
[{"$f":"A15+1","v":2},{"$f":"IFERROR(IF(IF(X16<=$X$4,X16,\"\")<$Y$7,\"\",IF(X16<=$X$4,X16,\"\")),\"\")","v":"2023-02-01"},{"$f":"SUMIFS('Bank Transfers'!$H$15:$H$514,'Bank Transfers'!$L$15:$L$514,B16,'Bank Transfers'!$E$15:$E$514,\"deposit\")","v":0},{"$f":"SUMIFS('Bank Transfers'!$H$15:$H$514,'Bank Transfers'!$L$15:$L$514,B16,'Bank Transfers'!$E$15:$E$514,\"withdraw\")","v":0},{"$f":"IF(B16=\"\",\"\",IF(B16='Bank Transfers'!$L$15,'Bank Transfers'!$H$15,J17))","v":{"v":54271.420000000006,"d":"$54,271.4"}},{"$f":"IFERROR(IF(B16='Bank Transfers'!$L$15,C16+D16-E16,C16+D16),0)","v":0},{"$f":"SUMIFS('TRADE LOG'!$M$15:$M$9733,WL,\"W\",datecode,B16)","v":0},{"$f":"SUMIFS('TRADE LOG'!$M$15:$M$9733,WL,\"L\",datecode,B16)","v":0},0,{"$f":"IFERROR(IF(B16=\"\",0,SUM(E16:I16)),\"\")","v":{"v":54271.420000000006,"d":"$54,271.4"}},{"$f":"IFERROR(G16+H16+I16,\"\")","v":0},0,null,0,"","",{"$f":"IFERROR(SUMIFS(PNLPercent,WL,\"L\",datecode,B16)/AH16,\"\")","v":""},{"$f":"IFERROR(P16/-Q16,\"\")","v":""},{"$f":"IFERROR(AV16/AW16,\"\")","v":""},"",{"$f":"IFERROR(SUMIFS('TRADE LOG'!$W$15:$W$9733,datecode,\"=\"&B16),\"\")","v":{"v":0,"d":"0.00R"}},null,null,{"$f":"EOMONTH(X15,-2)+1","v":44958},{"$f":"IF(J16=0,NA(),J16)","v":54271.420000000006},44958,{"$f":"SUMIFS(BuyAmount,datecode,\"=\"&'MONTHLY REPORT'!B16)","v":0},0,{"$f":"AA16-AB16","v":0},0,{"$error":"#VALUE!"},"",0,0,{"$f":"AI15-AG15","v":25},30,{"$f":"IFERROR(AI16/(AI16+AJ16),NA())","v":0.45454545454545453},0,0,{"$f":"AN15-AL15","v":1.705076118749654},{"$f":"AO15-AM15","v":-1.3355702575783988},{"$f":"IFERROR(AN16/AI16,0)","v":0.06820304474998616},{"$f":"IFERROR(AO16/AJ16,0)","v":-0.04451900858594662},{"$f":"AX16+AR17","v":0},{"$f":"AY16+AS17","v":0},{"$f":"AR16/AI16","v":0},{"$f":"-AS16/AJ16","v":0},{"$error":"#DIV/0!"},{"$error":"#DIV/0!"},0,0]
[3,{"$f":"IFERROR(IF(IF(X17<=$X$4,X17,\"\")<$Y$7,\"\",IF(X17<=$X$4,X17,\"\")),\"\")","v":"2023-01-01"},{"$f":"SUMIFS('Bank Transfers'!$H$15:$H$514,'Bank Transfers'!$L$15:$L$514,B17,'Bank Transfers'!$E$15:$E$514,\"deposit\")","v":0},{"$f":"SUMIFS('Bank Transfers'!$H$15:$H$514,'Bank Transfers'!$L$15:$L$514,B17,'Bank Transfers'!$E$15:$E$514,\"withdraw\")","v":0},{"$f":"IF(B17=\"\",\"\",IF(B17='Bank Transfers'!$L$15,'Bank Transfers'!$H$15,J18))","v":{"v":54271.420000000006,"d":"$54,271.4"}},{"$f":"IFERROR(IF(B17='Bank Transfers'!$L$15,C17+D17-E17,C17+D17),0)","v":0},{"$f":"SUMIFS('TRADE LOG'!$M$15:$M$9733,WL,\"W\",datecode,B17)","v":0},{"$f":"SUMIFS('TRADE LOG'!$M$15:$M$9733,WL,\"L\",datecode,B17)","v":0},0,{"$f":"IFERROR(IF(B17=\"\",0,SUM(E17:I17)),\"\")","v":{"v":54271.420000000006,"d":"$54,271.4"}},{"$f":"IFERROR(G17+H17+I17,\"\")","v":0},0,null,0,"","","","",{"$f":"IFERROR(AV17/AW17,\"\")","v":""},"",{"$f":"IFERROR(SUMIFS('TRADE LOG'!$W$15:$W$9733,datecode,\"=\"&B17),\"\")","v":{"v":0,"d":"0.00R"}},null,null,44927,54271.420000000006,44927,{"$f":"SUMIFS(BuyAmount,datecode,\"=\"&'MONTHLY REPORT'!B17)","v":0},0,0,0,{"$error":"#VALUE!"},"",0,0,25,30,0.45454545454545453,0,0,{"$f":"AN16-AL16","v":1.705076118749654},-1.3355702575783988,0.06820304474998616,-0.04451900858594662,{"$f":"AX17+AR18","v":0},{"$f":"AY17+AS18","v":0},0,0,{"$error":"#DIV/0!"},{"$error":"#DIV/0!"},0,0]
[4,{"$f":"IFERROR(IF(IF(X18<=$X$4,X18,\"\")<$Y$7,\"\",IF(X18<=$X$4,X18,\"\")),\"\")","v":"2022-12-01"},{"$f":"SUMIFS('Bank Transfers'!$H$15:$H$514,'Bank Transfers'!$L$15:$L$514,B18,'Bank Transfers'!$E$15:$E$514,\"deposit\")","v":0},{"$f":"SUMIFS('Bank Transfers'!$H$15:$H$514,'Bank Transfers'!$L$15:$L$514,B18,'Bank Transfers'!$E$15:$E$514,\"withdraw\")","v":0},{"$f":"IF(B18=\"\",\"\",IF(B18='Bank Transfers'!$L$15,'Bank Transfers'!$H$15,J19))","v":{"v":54271.420000000006,"d":"$54,271.4"}},{"$f":"IFERROR(IF(B18='Bank Transfers'!$L$15,C18+D18-E18,C18+D18),0)","v":0},{"$f":"SUMIFS('TRADE LOG'!$M$15:$M$9733,WL,\"W\",datecode,B18)","v":0},{"$f":"SUMIFS('TRADE LOG'!$M$15:$M$9733,WL,\"L\",datecode,B18)","v":0},0,{"v":54271.420000000006,"d":"$54,271.4"},0,0,null,0,"","","","","","",{"$f":"IFERROR(SUMIFS('TRADE LOG'!$W$15:$W$9733,datecode,\"=\"&B18),\"\")","v":{"v":0,"d":"0.00R"}},null,null,44896,54271.420000000006,44896,{"$f":"SUMIFS(BuyAmount,datecode,\"=\"&'MONTHLY REPORT'!B18)","v":0},0,0,0,{"$error":"#VALUE!"},"",0,0,25,30,0.45454545454545453,0,0,1.705076118749654,-1.3355702575783988,0.06820304474998616,-0.04451900858594662,{"$f":"AX18+AR19","v":0},0,0,0,{"$error":"#DIV/0!"},{"$error":"#DIV/0!"},0,0]
[5,"2022-11-01",{"$f":"SUMIFS('Bank Transfers'!$H$15:$H$514,'Bank Transfers'!$L$15:$L$514,B19,'Bank Transfers'!$E$15:$E$514,\"deposit\")","v":0},{"$f":"SUMIFS('Bank Transfers'!$H$15:$H$514,'Bank Transfers'!$L$15:$L$514,B19,'Bank Transfers'!$E$15:$E$514,\"withdraw\")","v":0},{"$f":"IF(B19=\"\",\"\",IF(B19='Bank Transfers'!$L$15,'Bank Transfers'!$H$15,J20))","v":{"v":54271.420000000006,"d":"$54,271.4"}},{"$f":"IFERROR(IF(B19='Bank Transfers'!$L$15,C19+D19-E19,C19+D19),0)","v":0},{"$f":"SUMIFS('TRADE LOG'!$M$15:$M$9733,WL,\"W\",datecode,B19)","v":0},{"$f":"SUMIFS('TRADE LOG'!$M$15:$M$9733,WL,\"L\",datecode,B19)","v":0},0,{"v":54271.420000000006,"d":"$54,271.4"},0,0,null,0,"","","","","","",{"$f":"IFERROR(SUMIFS('TRADE LOG'!$W$15:$W$9733,datecode,\"=\"&B19),\"\")","v":{"v":0,"d":"0.00R"}},null,null,44866,54271.420000000006,44866,{"$f":"SUMIFS(BuyAmount,datecode,\"=\"&'MONTHLY REPORT'!B19)","v":0},0,0,0,{"$error":"#VALUE!"},"",0,0,{"$f":"AI18-AG18","v":25},30,0.45454545454545453,0,0,1.705076118749654,{"$f":"AO18-AM18","v":-1.3355702575783988},0.06820304474998616,-0.04451900858594662,0,0,0,0,{"$error":"#DIV/0!"},{"$error":"#DIV/0!"},0,0]
[6,"2022-10-01",{"$f":"SUMIFS('Bank Transfers'!$H$15:$H$514,'Bank Transfers'!$L$15:$L$514,B20,'Bank Transfers'!$E$15:$E$514,\"deposit\")","v":0},{"$f":"SUMIFS('Bank Transfers'!$H$15:$H$514,'Bank Transfers'!$L$15:$L$514,B20,'Bank Transfers'!$E$15:$E$514,\"withdraw\")","v":0},{"$f":"IF(B20=\"\",\"\",IF(B20='Bank Transfers'!$L$15,'Bank Transfers'!$H$15,J21))","v":{"v":54271.420000000006,"d":"$54,271.4"}},{"$f":"IFERROR(IF(B20='Bank Transfers'!$L$15,C20+D20-E20,C20+D20),0)","v":0},{"$f":"SUMIFS('TRADE LOG'!$M$15:$M$9733,WL,\"W\",datecode,B20)","v":0},{"$f":"SUMIFS('TRADE LOG'!$M$15:$M$9733,WL,\"L\",datecode,B20)","v":0},0,{"v":54271.420000000006,"d":"$54,271.4"},0,0,null,0,"","","","","","",{"$f":"IFERROR(SUMIFS('TRADE LOG'!$W$15:$W$9733,datecode,\"=\"&B20),\"\")","v":{"v":0,"d":"0.00R"}},null,null,44835,54271.420000000006,44835,{"$f":"SUMIFS(BuyAmount,datecode,\"=\"&'MONTHLY REPORT'!B20)","v":0},0,0,0,{"$error":"#VALUE!"},"",0,0,25,30,0.45454545454545453,0,0,1.705076118749654,-1.3355702575783988,0.06820304474998616,-0.04451900858594662,0,0,0,0,{"$error":"#DIV/0!"},{"$error":"#DIV/0!"},0,0]
[7,"2022-09-01",{"$f":"SUMIFS('Bank Transfers'!$H$15:$H$514,'Bank Transfers'!$L$15:$L$514,B21,'Bank Transfers'!$E$15:$E$514,\"deposit\")","v":0},{"$f":"SUMIFS('Bank Transfers'!$H$15:$H$514,'Bank Transfers'!$L$15:$L$514,B21,'Bank Transfers'!$E$15:$E$514,\"withdraw\")","v":0},{"$f":"IF(B21=\"\",\"\",IF(B21='Bank Transfers'!$L$15,'Bank Transfers'!$H$15,J22))","v":{"v":54271.420000000006,"d":"$54,271.4"}},{"$f":"IFERROR(IF(B21='Bank Transfers'!$L$15,C21+D21-E21,C21+D21),0)","v":0},{"$f":"SUMIFS('TRADE LOG'!$M$15:$M$9733,WL,\"W\",datecode,B21)","v":0},{"$f":"SUMIFS('TRADE LOG'!$M$15:$M$9733,WL,\"L\",datecode,B21)","v":0},0,{"v":54271.420000000006,"d":"$54,271.4"},0,0,null,0,"","","","","","",{"$f":"IFERROR(SUMIFS('TRADE LOG'!$W$15:$W$9733,datecode,\"=\"&B21),\"\")","v":{"v":0,"d":"0.00R"}},null,null,44805,54271.420000000006,44805,{"$f":"SUMIFS(BuyAmount,datecode,\"=\"&'MONTHLY REPORT'!B21)","v":0},0,0,{"$nulls":3},0,0,{"$nulls":13},{"$error":"#DIV/0!"},{"$error":"#DIV/0!"},0,0]
[8,"2022-08-01",{"$f":"SUMIFS('Bank Transfers'!$H$15:$H$514,'Bank Transfers'!$L$15:$L$514,B22,'Bank Transfers'!$E$15:$E$514,\"deposit\")","v":0},{"$f":"SUMIFS('Bank Transfers'!$H$15:$H$514,'Bank Transfers'!$L$15:$L$514,B22,'Bank Transfers'!$E$15:$E$514,\"withdraw\")","v":0},{"$f":"IF(B22=\"\",\"\",IF(B22='Bank Transfers'!$L$15,'Bank Transfers'!$H$15,J23))","v":{"v":54271.420000000006,"d":"$54,271.4"}},{"$f":"IFERROR(IF(B22='Bank Transfers'!$L$15,C22+D22-E22,C22+D22),0)","v":0},{"$f":"SUMIFS('TRADE LOG'!$M$15:$M$9733,WL,\"W\",datecode,B22)","v":0},{"$f":"SUMIFS('TRADE LOG'!$M$15:$M$9733,WL,\"L\",datecode,B22)","v":0},0,{"v":54271.420000000006,"d":"$54,271.4"},0,0,null,0,"","","","","","",{"$f":"IFERROR(SUMIFS('TRADE LOG'!$W$15:$W$9733,datecode,\"=\"&B22),\"\")","v":{"v":0,"d":"0.00R"}},null,null,44774,54271.420000000006,44774,{"$f":"SUMIFS(BuyAmount,datecode,\"=\"&'MONTHLY REPORT'!B22)","v":0},0,0,{"$nulls":3},0,0,{"$nulls":13},{"$error":"#DIV/0!"},{"$error":"#DIV/0!"},0,0]
[9,"2022-07-01",{"$f":"SUMIFS('Bank Transfers'!$H$15:$H$514,'Bank Transfers'!$L$15:$L$514,B23,'Bank Transfers'!$E$15:$E$514,\"deposit\")","v":0},{"$f":"SUMIFS('Bank Transfers'!$H$15:$H$514,'Bank Transfers'!$L$15:$L$514,B23,'Bank Transfers'!$E$15:$E$514,\"withdraw\")","v":0},{"$f":"IF(B23=\"\",\"\",IF(B23='Bank Transfers'!$L$15,'Bank Transfers'!$H$15,J24))","v":{"v":54271.420000000006,"d":"$54,271.4"}},{"$f":"IFERROR(IF(B23='Bank Transfers'!$L$15,C23+D23-E23,C23+D23),0)","v":0},{"$f":"SUMIFS('TRADE LOG'!$M$15:$M$9733,WL,\"W\",datecode,B23)","v":0},{"$f":"SUMIFS('TRADE LOG'!$M$15:$M$9733,WL,\"L\",datecode,B23)","v":0},0,{"v":54271.420000000006,"d":"$54,271.4"},0,{"$f":"IFERROR(K23/IF(AND(B23<>\"\",E23<=0),F23,E23),\"\")","v":0},null,0,"","","","","","",{"$f":"IFERROR(SUMIFS('TRADE LOG'!$W$15:$W$9733,datecode,\"=\"&B23),\"\")","v":{"v":0,"d":"0.00R"}},null,null,44743,54271.420000000006,44743,{"$f":"SUMIFS(BuyAmount,datecode,\"=\"&'MONTHLY REPORT'!B23)","v":0},0,0,{"$nulls":3},0,0,{"$nulls":13},{"$error":"#DIV/0!"},{"$error":"#DIV/0!"},0,0]
[10,"2022-06-01",{"$f":"SUMIFS('Bank Transfers'!$H$15:$H$514,'Bank Transfers'!$L$15:$L$514,B24,'Bank Transfers'!$E$15:$E$514,\"deposit\")","v":0},{"$f":"SUMIFS('Bank Transfers'!$H$15:$H$514,'Bank Transfers'!$L$15:$L$514,B24,'Bank Transfers'!$E$15:$E$514,\"withdraw\")","v":0},{"$f":"IF(B24=\"\",\"\",IF(B24='Bank Transfers'!$L$15,'Bank Transfers'!$H$15,J25))","v":{"v":54271.420000000006,"d":"$54,271.4"}},{"$f":"IFERROR(IF(B24='Bank Transfers'!$L$15,C24+D24-E24,C24+D24),0)","v":0},{"$f":"SUMIFS('TRADE LOG'!$M$15:$M$9733,WL,\"W\",datecode,B24)","v":0},{"$f":"SUMIFS('TRADE LOG'!$M$15:$M$9733,WL,\"L\",datecode,B24)","v":0},0,{"v":54271.420000000006,"d":"$54,271.4"},0,{"$f":"IFERROR(K24/IF(AND(B24<>\"\",E24<=0),F24,E24),\"\")","v":0},null,0,"","","","","","",{"$f":"IFERROR(SUMIFS('TRADE LOG'!$W$15:$W$9733,datecode,\"=\"&B24),\"\")","v":{"v":0,"d":"0.00R"}},null,null,44713,54271.420000000006,44713,{"$f":"SUMIFS(BuyAmount,datecode,\"=\"&'MONTHLY REPORT'!B24)","v":0},0,0,{"$nulls":3},0,0,{"$nulls":13},{"$error":"#DIV/0!"},{"$error":"#DIV/0!"},0,0]
[11,"2022-05-01",{"$f":"SUMIFS('Bank Transfers'!$H$15:$H$514,'Bank Transfers'!$L$15:$L$514,B25,'Bank Transfers'!$E$15:$E$514,\"deposit\")","v":0},{"$f":"SUMIFS('Bank Transfers'!$H$15:$H$514,'Bank Transfers'!$L$15:$L$514,B25,'Bank Transfers'!$E$15:$E$514,\"withdraw\")","v":0},{"$f":"IF(B25=\"\",\"\",IF(B25='Bank Transfers'!$L$15,'Bank Transfers'!$H$15,J26))","v":{"v":54271.420000000006,"d":"$54,271.4"}},{"$f":"IFERROR(IF(B25='Bank Transfers'!$L$15,C25+D25-E25,C25+D25),0)","v":0},{"$f":"SUMIFS('TRADE LOG'!$M$15:$M$9733,WL,\"W\",datecode,B25)","v":0},{"$f":"SUMIFS('TRADE LOG'!$M$15:$M$9733,WL,\"L\",datecode,B25)","v":0},0,{"v":54271.420000000006,"d":"$54,271.4"},0,0,null,0,"","","","","","",{"$f":"IFERROR(SUMIFS('TRADE LOG'!$W$15:$W$9733,datecode,\"=\"&B25),\"\")","v":{"v":0,"d":"0.00R"}},null,null,44682,54271.420000000006,44682,{"$f":"SUMIFS(BuyAmount,datecode,\"=\"&'MONTHLY REPORT'!B25)","v":0},0,0,{"$nulls":3},0,0,{"$nulls":13},{"$error":"#DIV/0!"},{"$error":"#DIV/0!"},0,0]
[12,"2022-04-01",{"$f":"SUMIFS('Bank Transfers'!$H$15:$H$514,'Bank Transfers'!$L$15:$L$514,B26,'Bank Transfers'!$E$15:$E$514,\"deposit\")","v":0},{"$f":"SUMIFS('Bank Transfers'!$H$15:$H$514,'Bank Transfers'!$L$15:$L$514,B26,'Bank Transfers'!$E$15:$E$514,\"withdraw\")","v":0},{"$f":"IF(B26=\"\",\"\",IF(B26='Bank Transfers'!$L$15,'Bank Transfers'!$H$15,J27))","v":{"v":54271.420000000006,"d":"$54,271.4"}},{"$f":"IFERROR(IF(B26='Bank Transfers'!$L$15,C26+D26-E26,C26+D26),0)","v":0},{"$f":"SUMIFS('TRADE LOG'!$M$15:$M$9733,WL,\"W\",datecode,B26)","v":0},{"$f":"SUMIFS('TRADE LOG'!$M$15:$M$9733,WL,\"L\",datecode,B26)","v":0},0,{"v":54271.420000000006,"d":"$54,271.4"},0,0,null,0,"","","","","","",{"$f":"IFERROR(SUMIFS('TRADE LOG'!$W$15:$W$9733,datecode,\"=\"&B26),\"\")","v":{"v":0,"d":"0.00R"}},null,null,44652,54271.420000000006,44652,{"$f":"SUMIFS(BuyAmount,datecode,\"=\"&'MONTHLY REPORT'!B26)","v":0},0,0,{"$nulls":3},0,0,{"$nulls":13},{"$error":"#DIV/0!"},{"$error":"#DIV/0!"},0,0]
[13,"2022-03-01",{"$f":"SUMIFS('Bank Transfers'!$H$15:$H$514,'Bank Transfers'!$L$15:$L$514,B27,'Bank Transfers'!$E$15:$E$514,\"deposit\")","v":0},{"$f":"SUMIFS('Bank Transfers'!$H$15:$H$514,'Bank Transfers'!$L$15:$L$514,B27,'Bank Transfers'!$E$15:$E$514,\"withdraw\")","v":0},{"$f":"IF(B27=\"\",\"\",IF(B27='Bank Transfers'!$L$15,'Bank Transfers'!$H$15,J28))","v":{"v":54271.420000000006,"d":"$54,271.4"}},{"$f":"IFERROR(IF(B27='Bank Transfers'!$L$15,C27+D27-E27,C27+D27),0)","v":0},{"$f":"SUMIFS('TRADE LOG'!$M$15:$M$9733,WL,\"W\",datecode,B27)","v":0},{"$f":"SUMIFS('TRADE LOG'!$M$15:$M$9733,WL,\"L\",datecode,B27)","v":0},0,{"v":54271.420000000006,"d":"$54,271.4"},0,0,null,0,"","","","","","",{"$f":"IFERROR(SUMIFS('TRADE LOG'!$W$15:$W$9733,datecode,\"=\"&B27),\"\")","v":{"v":0,"d":"0.00R"}},null,null,44621,54271.420000000006,44621,{"$f":"SUMIFS(BuyAmount,datecode,\"=\"&'MONTHLY REPORT'!B27)","v":0},0,0,{"$nulls":3},0,0,{"$nulls":13},{"$error":"#DIV/0!"},{"$error":"#DIV/0!"},0,0]
[14,"2022-02-01",{"$f":"SUMIFS('Bank Transfers'!$H$15:$H$514,'Bank Transfers'!$L$15:$L$514,B28,'Bank Transfers'!$E$15:$E$514,\"deposit\")","v":0},{"$f":"SUMIFS('Bank Transfers'!$H$15:$H$514,'Bank Transfers'!$L$15:$L$514,B28,'Bank Transfers'!$E$15:$E$514,\"withdraw\")","v":0},{"$f":"IF(B28=\"\",\"\",IF(B28='Bank Transfers'!$L$15,'Bank Transfers'!$H$15,J29))","v":{"v":54271.420000000006,"d":"$54,271.4"}},{"$f":"IFERROR(IF(B28='Bank Transfers'!$L$15,C28+D28-E28,C28+D28),0)","v":0},{"$f":"SUMIFS('TRADE LOG'!$M$15:$M$9733,WL,\"W\",datecode,B28)","v":0},{"$f":"SUMIFS('TRADE LOG'!$M$15:$M$9733,WL,\"L\",datecode,B28)","v":0},0,{"v":54271.420000000006,"d":"$54,271.4"},0,0,null,0,"","","","","","",{"$f":"IFERROR(SUMIFS('TRADE LOG'!$W$15:$W$9733,datecode,\"=\"&B28),\"\")","v":{"v":0,"d":"0.00R"}},null,null,44593,54271.420000000006,44593,{"$f":"SUMIFS(BuyAmount,datecode,\"=\"&'MONTHLY REPORT'!B28)","v":0},0,0,{"$nulls":3},0,0,{"$nulls":13},{"$error":"#DIV/0!"},{"$error":"#DIV/0!"},0,0]
[15,"2022-01-01",{"$f":"SUMIFS('Bank Transfers'!$H$15:$H$514,'Bank Transfers'!$L$15:$L$514,B29,'Bank Transfers'!$E$15:$E$514,\"deposit\")","v":0},{"$f":"SUMIFS('Bank Transfers'!$H$15:$H$514,'Bank Transfers'!$L$15:$L$514,B29,'Bank Transfers'!$E$15:$E$514,\"withdraw\")","v":0},{"$f":"IF(B29=\"\",\"\",IF(B29='Bank Transfers'!$L$15,'Bank Transfers'!$H$15,J30))","v":{"v":54271.420000000006,"d":"$54,271.4"}},{"$f":"IFERROR(IF(B29='Bank Transfers'!$L$15,C29+D29-E29,C29+D29),0)","v":0},{"$f":"SUMIFS('TRADE LOG'!$M$15:$M$9733,WL,\"W\",datecode,B29)","v":0},{"$f":"SUMIFS('TRADE LOG'!$M$15:$M$9733,WL,\"L\",datecode,B29)","v":0},0,{"v":54271.420000000006,"d":"$54,271.4"},0,0,null,0,"","","","","","",{"$f":"IFERROR(SUMIFS('TRADE LOG'!$W$15:$W$9733,datecode,\"=\"&B29),\"\")","v":{"v":0,"d":"0.00R"}},null,null,44562,54271.420000000006,44562,{"$f":"SUMIFS(BuyAmount,datecode,\"=\"&'MONTHLY REPORT'!B29)","v":0},0,0,{"$nulls":3},0,0,{"$nulls":13},{"$error":"#DIV/0!"},{"$error":"#DIV/0!"},0,0]
[16,"2021-12-01",{"$f":"SUMIFS('Bank Transfers'!$H$15:$H$514,'Bank Transfers'!$L$15:$L$514,B30,'Bank Transfers'!$E$15:$E$514,\"deposit\")","v":0},{"$f":"SUMIFS('Bank Transfers'!$H$15:$H$514,'Bank Transfers'!$L$15:$L$514,B30,'Bank Transfers'!$E$15:$E$514,\"withdraw\")","v":0},{"$f":"IF(B30=\"\",\"\",IF(B30='Bank Transfers'!$L$15,'Bank Transfers'!$H$15,J31))","v":{"v":54271.420000000006,"d":"$54,271.4"}},{"$f":"IFERROR(IF(B30='Bank Transfers'!$L$15,C30+D30-E30,C30+D30),0)","v":0},{"$f":"SUMIFS('TRADE LOG'!$M$15:$M$9733,WL,\"W\",datecode,B30)","v":0},{"$f":"SUMIFS('TRADE LOG'!$M$15:$M$9733,WL,\"L\",datecode,B30)","v":0},0,{"v":54271.420000000006,"d":"$54,271.4"},0,0,null,0,"","","","","","",{"$f":"IFERROR(SUMIFS('TRADE LOG'!$W$15:$W$9733,datecode,\"=\"&B30),\"\")","v":{"v":0,"d":"0.00R"}},null,null,44531,54271.420000000006,44531,{"$f":"SUMIFS(BuyAmount,datecode,\"=\"&'MONTHLY REPORT'!B30)","v":0},0,0,{"$nulls":3},0,0,{"$nulls":13},{"$error":"#DIV/0!"},{"$error":"#DIV/0!"},0,0]
[17,"2021-11-01",{"$f":"SUMIFS('Bank Transfers'!$H$15:$H$514,'Bank Transfers'!$L$15:$L$514,B31,'Bank Transfers'!$E$15:$E$514,\"deposit\")","v":0},{"$f":"SUMIFS('Bank Transfers'!$H$15:$H$514,'Bank Transfers'!$L$15:$L$514,B31,'Bank Transfers'!$E$15:$E$514,\"withdraw\")","v":0},{"$f":"IF(B31=\"\",\"\",IF(B31='Bank Transfers'!$L$15,'Bank Transfers'!$H$15,J32))","v":{"v":54271.420000000006,"d":"$54,271.4"}},{"$f":"IFERROR(IF(B31='Bank Transfers'!$L$15,C31+D31-E31,C31+D31),0)","v":0},{"$f":"SUMIFS('TRADE LOG'!$M$15:$M$9733,WL,\"W\",datecode,B31)","v":0},{"$f":"SUMIFS('TRADE LOG'!$M$15:$M$9733,WL,\"L\",datecode,B31)","v":0},0,{"v":54271.420000000006,"d":"$54,271.4"},0,0,null,0,"","","","","","",{"$f":"IFERROR(SUMIFS('TRADE LOG'!$W$15:$W$9733,datecode,\"=\"&B31),\"\")","v":{"v":0,"d":"0.00R"}},null,null,44501,54271.420000000006,44501,{"$f":"SUMIFS(BuyAmount,datecode,\"=\"&'MONTHLY REPORT'!B31)","v":0},0,0,{"$nulls":3},0,0,{"$nulls":13},{"$error":"#DIV/0!"},{"$error":"#DIV/0!"},0,0]
[18,"2021-10-01",{"$f":"SUMIFS('Bank Transfers'!$H$15:$H$514,'Bank Transfers'!$L$15:$L$514,B32,'Bank Transfers'!$E$15:$E$514,\"deposit\")","v":0},{"$f":"SUMIFS('Bank Transfers'!$H$15:$H$514,'Bank Transfers'!$L$15:$L$514,B32,'Bank Transfers'!$E$15:$E$514,\"withdraw\")","v":0},{"$f":"IF(B32=\"\",\"\",IF(B32='Bank Transfers'!$L$15,'Bank Transfers'!$H$15,J33))","v":{"v":54271.420000000006,"d":"$54,271.4"}},{"$f":"IFERROR(IF(B32='Bank Transfers'!$L$15,C32+D32-E32,C32+D32),0)","v":0},{"$f":"SUMIFS('TRADE LOG'!$M$15:$M$9733,WL,\"W\",datecode,B32)","v":0},{"$f":"SUMIFS('TRADE LOG'!$M$15:$M$9733,WL,\"L\",datecode,B32)","v":0},0,{"v":54271.420000000006,"d":"$54,271.4"},0,0,null,0,"","","","","","",{"$f":"IFERROR(SUMIFS('TRADE LOG'!$W$15:$W$9733,datecode,\"=\"&B32),\"\")","v":{"v":0,"d":"0.00R"}},null,null,44470,54271.420000000006,44470,{"$f":"SUMIFS(BuyAmount,datecode,\"=\"&'MONTHLY REPORT'!B32)","v":0},0,0,{"$nulls":3},0,0,{"$nulls":13},{"$error":"#DIV/0!"},{"$error":"#DIV/0!"},0,0]
[19,"2021-09-01",{"$f":"SUMIFS('Bank Transfers'!$H$15:$H$514,'Bank Transfers'!$L$15:$L$514,B33,'Bank Transfers'!$E$15:$E$514,\"deposit\")","v":0},{"$f":"SUMIFS('Bank Transfers'!$H$15:$H$514,'Bank Transfers'!$L$15:$L$514,B33,'Bank Transfers'!$E$15:$E$514,\"withdraw\")","v":0},{"$f":"IF(B33=\"\",\"\",IF(B33='Bank Transfers'!$L$15,'Bank Transfers'!$H$15,J34))","v":{"v":54271.420000000006,"d":"$54,271.4"}},{"$f":"IFERROR(IF(B33='Bank Transfers'!$L$15,C33+D33-E33,C33+D33),0)","v":0},{"$f":"SUMIFS('TRADE LOG'!$M$15:$M$9733,WL,\"W\",datecode,B33)","v":0},{"$f":"SUMIFS('TRADE LOG'!$M$15:$M$9733,WL,\"L\",datecode,B33)","v":0},0,{"v":54271.420000000006,"d":"$54,271.4"},0,0,null,0,"","","","","","",{"$f":"IFERROR(SUMIFS('TRADE LOG'!$W$15:$W$9733,datecode,\"=\"&B33),\"\")","v":{"v":0,"d":"0.00R"}},null,null,44440,54271.420000000006,44440,{"$f":"SUMIFS(BuyAmount,datecode,\"=\"&'MONTHLY REPORT'!B33)","v":0},0,0,{"$nulls":3},0,0,{"$nulls":13},{"$error":"#DIV/0!"},{"$error":"#DIV/0!"},0,0]
[20,"2021-08-01",{"$f":"SUMIFS('Bank Transfers'!$H$15:$H$514,'Bank Transfers'!$L$15:$L$514,B34,'Bank Transfers'!$E$15:$E$514,\"deposit\")","v":0},{"$f":"SUMIFS('Bank Transfers'!$H$15:$H$514,'Bank Transfers'!$L$15:$L$514,B34,'Bank Transfers'!$E$15:$E$514,\"withdraw\")","v":0},{"$f":"IF(B34=\"\",\"\",IF(B34='Bank Transfers'!$L$15,'Bank Transfers'!$H$15,J35))","v":{"v":54271.420000000006,"d":"$54,271.4"}},{"$f":"IFERROR(IF(B34='Bank Transfers'!$L$15,C34+D34-E34,C34+D34),0)","v":0},{"$f":"SUMIFS('TRADE LOG'!$M$15:$M$9733,WL,\"W\",datecode,B34)","v":0},{"$f":"SUMIFS('TRADE LOG'!$M$15:$M$9733,WL,\"L\",datecode,B34)","v":0},0,{"v":54271.420000000006,"d":"$54,271.4"},0,0,null,0,"","","","","","",{"$f":"IFERROR(SUMIFS('TRADE LOG'!$W$15:$W$9733,datecode,\"=\"&B34),\"\")","v":{"v":0,"d":"0.00R"}},null,null,44409,54271.420000000006,44409,{"$f":"SUMIFS(BuyAmount,datecode,\"=\"&'MONTHLY REPORT'!B34)","v":0},0,0,{"$nulls":3},0,0,{"$nulls":13},{"$error":"#DIV/0!"},{"$error":"#DIV/0!"},0,0]
[21,"2021-07-01",{"$f":"SUMIFS('Bank Transfers'!$H$15:$H$514,'Bank Transfers'!$L$15:$L$514,B35,'Bank Transfers'!$E$15:$E$514,\"deposit\")","v":0},{"$f":"SUMIFS('Bank Transfers'!$H$15:$H$514,'Bank Transfers'!$L$15:$L$514,B35,'Bank Transfers'!$E$15:$E$514,\"withdraw\")","v":0},{"$f":"IF(B35=\"\",\"\",IF(B35='Bank Transfers'!$L$15,'Bank Transfers'!$H$15,J36))","v":{"v":54271.420000000006,"d":"$54,271.4"}},{"$f":"IFERROR(IF(B35='Bank Transfers'!$L$15,C35+D35-E35,C35+D35),0)","v":0},{"$f":"SUMIFS('TRADE LOG'!$M$15:$M$9733,WL,\"W\",datecode,B35)","v":0},{"$f":"SUMIFS('TRADE LOG'!$M$15:$M$9733,WL,\"L\",datecode,B35)","v":0},0,{"v":54271.420000000006,"d":"$54,271.4"},0,0,null,0,"","","","","","",{"$f":"IFERROR(SUMIFS('TRADE LOG'!$W$15:$W$9733,datecode,\"=\"&B35),\"\")","v":{"v":0,"d":"0.00R"}},null,null,44378,54271.420000000006,44378,{"$f":"SUMIFS(BuyAmount,datecode,\"=\"&'MONTHLY REPORT'!B35)","v":0},0,0,{"$nulls":3},0,0,{"$nulls":13},{"$error":"#DIV/0!"},{"$error":"#DIV/0!"},0,0]
[22,"2021-06-01",{"$f":"SUMIFS('Bank Transfers'!$H$15:$H$514,'Bank Transfers'!$L$15:$L$514,B36,'Bank Transfers'!$E$15:$E$514,\"deposit\")","v":0},{"$f":"SUMIFS('Bank Transfers'!$H$15:$H$514,'Bank Transfers'!$L$15:$L$514,B36,'Bank Transfers'!$E$15:$E$514,\"withdraw\")","v":0},{"$f":"IF(B36=\"\",\"\",IF(B36='Bank Transfers'!$L$15,'Bank Transfers'!$H$15,J37))","v":{"v":54271.420000000006,"d":"$54,271.4"}},{"$f":"IFERROR(IF(B36='Bank Transfers'!$L$15,C36+D36-E36,C36+D36),0)","v":0},{"$f":"SUMIFS('TRADE LOG'!$M$15:$M$9733,WL,\"W\",datecode,B36)","v":0},{"$f":"SUMIFS('TRADE LOG'!$M$15:$M$9733,WL,\"L\",datecode,B36)","v":0},0,{"v":54271.420000000006,"d":"$54,271.4"},0,0,null,0,"","","","","","",{"$f":"IFERROR(SUMIFS('TRADE LOG'!$W$15:$W$9733,datecode,\"=\"&B36),\"\")","v":{"v":0,"d":"0.00R"}},null,null,44348,54271.420000000006,44348,{"$f":"SUMIFS(BuyAmount,datecode,\"=\"&'MONTHLY REPORT'!B36)","v":0},0,0,{"$nulls":3},0,0,{"$nulls":13},{"$error":"#DIV/0!"},{"$error":"#DIV/0!"},0,0]
[23,"2021-05-01",{"$f":"SUMIFS('Bank Transfers'!$H$15:$H$514,'Bank Transfers'!$L$15:$L$514,B37,'Bank Transfers'!$E$15:$E$514,\"deposit\")","v":0},{"$f":"SUMIFS('Bank Transfers'!$H$15:$H$514,'Bank Transfers'!$L$15:$L$514,B37,'Bank Transfers'!$E$15:$E$514,\"withdraw\")","v":0},{"$f":"IF(B37=\"\",\"\",IF(B37='Bank Transfers'!$L$15,'Bank Transfers'!$H$15,J38))","v":{"v":54271.420000000006,"d":"$54,271.4"}},{"$f":"IFERROR(IF(B37='Bank Transfers'!$L$15,C37+D37-E37,C37+D37),0)","v":0},{"$f":"SUMIFS('TRADE LOG'!$M$15:$M$9733,WL,\"W\",datecode,B37)","v":0},{"$f":"SUMIFS('TRADE LOG'!$M$15:$M$9733,WL,\"L\",datecode,B37)","v":0},0,{"v":54271.420000000006,"d":"$54,271.4"},0,0,null,0,"","","","","","",{"$f":"IFERROR(SUMIFS('TRADE LOG'!$W$15:$W$9733,datecode,\"=\"&B37),\"\")","v":{"v":0,"d":"0.00R"}},null,null,44317,54271.420000000006,44317,{"$f":"SUMIFS(BuyAmount,datecode,\"=\"&'MONTHLY REPORT'!B37)","v":0},0,0,{"$nulls":3},0,0,{"$nulls":13},{"$error":"#DIV/0!"},{"$error":"#DIV/0!"},0,0]
[24,"2021-04-01",{"$f":"SUMIFS('Bank Transfers'!$H$15:$H$514,'Bank Transfers'!$L$15:$L$514,B38,'Bank Transfers'!$E$15:$E$514,\"deposit\")","v":0},{"$f":"SUMIFS('Bank Transfers'!$H$15:$H$514,'Bank Transfers'!$L$15:$L$514,B38,'Bank Transfers'!$E$15:$E$514,\"withdraw\")","v":0},{"$f":"IF(B38=\"\",\"\",IF(B38='Bank Transfers'!$L$15,'Bank Transfers'!$H$15,J39))","v":{"v":54271.420000000006,"d":"$54,271.4"}},{"$f":"IFERROR(IF(B38='Bank Transfers'!$L$15,C38+D38-E38,C38+D38),0)","v":0},{"$f":"SUMIFS('TRADE LOG'!$M$15:$M$9733,WL,\"W\",datecode,B38)","v":0},{"$f":"SUMIFS('TRADE LOG'!$M$15:$M$9733,WL,\"L\",datecode,B38)","v":0},0,{"v":54271.420000000006,"d":"$54,271.4"},0,0,null,0,"","","","","","",{"$f":"IFERROR(SUMIFS('TRADE LOG'!$W$15:$W$9733,datecode,\"=\"&B38),\"\")","v":{"v":0,"d":"0.00R"}},null,null,44287,54271.420000000006,44287,{"$f":"SUMIFS(BuyAmount,datecode,\"=\"&'MONTHLY REPORT'!B38)","v":0},0,0,{"$nulls":3},0,0,{"$nulls":13},{"$error":"#DIV/0!"},{"$error":"#DIV/0!"},0,0]
[25,"2021-03-01",{"$f":"SUMIFS('Bank Transfers'!$H$15:$H$514,'Bank Transfers'!$L$15:$L$514,B39,'Bank Transfers'!$E$15:$E$514,\"deposit\")","v":0},{"$f":"SUMIFS('Bank Transfers'!$H$15:$H$514,'Bank Transfers'!$L$15:$L$514,B39,'Bank Transfers'!$E$15:$E$514,\"withdraw\")","v":0},{"$f":"IF(B39=\"\",\"\",IF(B39='Bank Transfers'!$L$15,'Bank Transfers'!$H$15,J40))","v":{"v":54271.420000000006,"d":"$54,271.4"}},{"$f":"IFERROR(IF(B39='Bank Transfers'!$L$15,C39+D39-E39,C39+D39),0)","v":0},{"$f":"SUMIFS('TRADE LOG'!$M$15:$M$9733,WL,\"W\",datecode,B39)","v":0},{"$f":"SUMIFS('TRADE LOG'!$M$15:$M$9733,WL,\"L\",datecode,B39)","v":0},0,{"v":54271.420000000006,"d":"$54,271.4"},0,0,null,0,"","","","","","",{"$f":"IFERROR(SUMIFS('TRADE LOG'!$W$15:$W$9733,datecode,\"=\"&B39),\"\")","v":{"v":0,"d":"0.00R"}},null,null,44256,54271.420000000006,44256,{"$f":"SUMIFS(BuyAmount,datecode,\"=\"&'MONTHLY REPORT'!B39)","v":0},0,0,{"$nulls":3},0,0,{"$nulls":13},{"$error":"#DIV/0!"},{"$error":"#DIV/0!"},0,0]
[26,"2021-02-01",{"$f":"SUMIFS('Bank Transfers'!$H$15:$H$514,'Bank Transfers'!$L$15:$L$514,B40,'Bank Transfers'!$E$15:$E$514,\"deposit\")","v":0},{"$f":"SUMIFS('Bank Transfers'!$H$15:$H$514,'Bank Transfers'!$L$15:$L$514,B40,'Bank Transfers'!$E$15:$E$514,\"withdraw\")","v":0},{"$f":"IF(B40=\"\",\"\",IF(B40='Bank Transfers'!$L$15,'Bank Transfers'!$H$15,J41))","v":{"v":54271.420000000006,"d":"$54,271.4"}},{"$f":"IFERROR(IF(B40='Bank Transfers'!$L$15,C40+D40-E40,C40+D40),0)","v":0},{"$f":"SUMIFS('TRADE LOG'!$M$15:$M$9733,WL,\"W\",datecode,B40)","v":0},{"$f":"SUMIFS('TRADE LOG'!$M$15:$M$9733,WL,\"L\",datecode,B40)","v":0},0,{"v":54271.420000000006,"d":"$54,271.4"},0,0,null,0,"","","","","","",{"$f":"IFERROR(SUMIFS('TRADE LOG'!$W$15:$W$9733,datecode,\"=\"&B40),\"\")","v":{"v":0,"d":"0.00R"}},null,null,44228,54271.420000000006,44228,{"$f":"SUMIFS(BuyAmount,datecode,\"=\"&'MONTHLY REPORT'!B40)","v":0},0,0,{"$nulls":3},0,0,{"$nulls":13},{"$error":"#DIV/0!"},{"$error":"#DIV/0!"},0,0]
[27,"2021-01-01",{"$f":"SUMIFS('Bank Transfers'!$H$15:$H$514,'Bank Transfers'!$L$15:$L$514,B41,'Bank Transfers'!$E$15:$E$514,\"deposit\")","v":0},{"$f":"SUMIFS('Bank Transfers'!$H$15:$H$514,'Bank Transfers'!$L$15:$L$514,B41,'Bank Transfers'!$E$15:$E$514,\"withdraw\")","v":0},{"$f":"IF(B41=\"\",\"\",IF(B41='Bank Transfers'!$L$15,'Bank Transfers'!$H$15,J42))","v":{"v":54271.420000000006,"d":"$54,271.4"}},{"$f":"IFERROR(IF(B41='Bank Transfers'!$L$15,C41+D41-E41,C41+D41),0)","v":0},{"$f":"SUMIFS('TRADE LOG'!$M$15:$M$9733,WL,\"W\",datecode,B41)","v":0},{"$f":"SUMIFS('TRADE LOG'!$M$15:$M$9733,WL,\"L\",datecode,B41)","v":0},0,{"v":54271.420000000006,"d":"$54,271.4"},0,0,null,0,"","","","","","",{"$f":"IFERROR(SUMIFS('TRADE LOG'!$W$15:$W$9733,datecode,\"=\"&B41),\"\")","v":{"v":0,"d":"0.00R"}},null,null,44197,54271.420000000006,44197,{"$f":"SUMIFS(BuyAmount,datecode,\"=\"&'MONTHLY REPORT'!B41)","v":0},0,0,{"$nulls":3},0,0,{"$nulls":13},{"$error":"#DIV/0!"},{"$error":"#DIV/0!"},0,0]
[28,"2020-12-01",{"$f":"SUMIFS('Bank Transfers'!$H$15:$H$514,'Bank Transfers'!$L$15:$L$514,B42,'Bank Transfers'!$E$15:$E$514,\"deposit\")","v":0},{"$f":"SUMIFS('Bank Transfers'!$H$15:$H$514,'Bank Transfers'!$L$15:$L$514,B42,'Bank Transfers'!$E$15:$E$514,\"withdraw\")","v":0},{"$f":"IF(B42=\"\",\"\",IF(B42='Bank Transfers'!$L$15,'Bank Transfers'!$H$15,J43))","v":{"v":54271.420000000006,"d":"$54,271.4"}},{"$f":"IFERROR(IF(B42='Bank Transfers'!$L$15,C42+D42-E42,C42+D42),0)","v":0},{"$f":"SUMIFS('TRADE LOG'!$M$15:$M$9733,WL,\"W\",datecode,B42)","v":0},{"$f":"SUMIFS('TRADE LOG'!$M$15:$M$9733,WL,\"L\",datecode,B42)","v":0},0,{"v":54271.420000000006,"d":"$54,271.4"},0,0,null,0,"","","","","","",{"$f":"IFERROR(SUMIFS('TRADE LOG'!$W$15:$W$9733,datecode,\"=\"&B42),\"\")","v":{"v":0,"d":"0.00R"}},null,null,44166,54271.420000000006,44166,{"$f":"SUMIFS(BuyAmount,datecode,\"=\"&'MONTHLY REPORT'!B42)","v":0},0,0,{"$nulls":3},0,0,{"$nulls":13},{"$error":"#DIV/0!"},{"$error":"#DIV/0!"},0,0]
[29,"2020-11-01",{"$f":"SUMIFS('Bank Transfers'!$H$15:$H$514,'Bank Transfers'!$L$15:$L$514,B43,'Bank Transfers'!$E$15:$E$514,\"deposit\")","v":0},{"$f":"SUMIFS('Bank Transfers'!$H$15:$H$514,'Bank Transfers'!$L$15:$L$514,B43,'Bank Transfers'!$E$15:$E$514,\"withdraw\")","v":0},{"$f":"IF(B43=\"\",\"\",IF(B43='Bank Transfers'!$L$15,'Bank Transfers'!$H$15,J44))","v":{"v":54271.420000000006,"d":"$54,271.4"}},{"$f":"IFERROR(IF(B43='Bank Transfers'!$L$15,C43+D43-E43,C43+D43),0)","v":0},{"$f":"SUMIFS('TRADE LOG'!$M$15:$M$9733,WL,\"W\",datecode,B43)","v":0},{"$f":"SUMIFS('TRADE LOG'!$M$15:$M$9733,WL,\"L\",datecode,B43)","v":0},0,{"v":54271.420000000006,"d":"$54,271.4"},0,0,null,0,"","","","","","",{"$f":"IFERROR(SUMIFS('TRADE LOG'!$W$15:$W$9733,datecode,\"=\"&B43),\"\")","v":{"v":0,"d":"0.00R"}},null,null,44136,54271.420000000006,44136,{"$f":"SUMIFS(BuyAmount,datecode,\"=\"&'MONTHLY REPORT'!B43)","v":0},0,0,{"$nulls":3},0,0,{"$nulls":13},{"$error":"#DIV/0!"},{"$error":"#DIV/0!"},0,0]
[30,"2020-10-01",{"$f":"SUMIFS('Bank Transfers'!$H$15:$H$514,'Bank Transfers'!$L$15:$L$514,B44,'Bank Transfers'!$E$15:$E$514,\"deposit\")","v":0},{"$f":"SUMIFS('Bank Transfers'!$H$15:$H$514,'Bank Transfers'!$L$15:$L$514,B44,'Bank Transfers'!$E$15:$E$514,\"withdraw\")","v":0},{"$f":"IF(B44=\"\",\"\",IF(B44='Bank Transfers'!$L$15,'Bank Transfers'!$H$15,J45))","v":{"v":54271.420000000006,"d":"$54,271.4"}},{"$f":"IFERROR(IF(B44='Bank Transfers'!$L$15,C44+D44-E44,C44+D44),0)","v":0},{"$f":"SUMIFS('TRADE LOG'!$M$15:$M$9733,WL,\"W\",datecode,B44)","v":0},{"$f":"SUMIFS('TRADE LOG'!$M$15:$M$9733,WL,\"L\",datecode,B44)","v":0},0,{"v":54271.420000000006,"d":"$54,271.4"},0,0,null,0,"","","","","","",{"$f":"IFERROR(SUMIFS('TRADE LOG'!$W$15:$W$9733,datecode,\"=\"&B44),\"\")","v":{"v":0,"d":"0.00R"}},null,null,44105,54271.420000000006,44105,{"$f":"SUMIFS(BuyAmount,datecode,\"=\"&'MONTHLY REPORT'!B44)","v":0},0,0,{"$nulls":3},0,0,{"$nulls":13},{"$error":"#DIV/0!"},{"$error":"#DIV/0!"},0,0]
[31,"2020-09-01",{"$f":"SUMIFS('Bank Transfers'!$H$15:$H$514,'Bank Transfers'!$L$15:$L$514,B45,'Bank Transfers'!$E$15:$E$514,\"deposit\")","v":0},{"$f":"SUMIFS('Bank Transfers'!$H$15:$H$514,'Bank Transfers'!$L$15:$L$514,B45,'Bank Transfers'!$E$15:$E$514,\"withdraw\")","v":0},{"$f":"IF(B45=\"\",\"\",IF(B45='Bank Transfers'!$L$15,'Bank Transfers'!$H$15,J46))","v":{"v":54271.420000000006,"d":"$54,271.4"}},{"$f":"IFERROR(IF(B45='Bank Transfers'!$L$15,C45+D45-E45,C45+D45),0)","v":0},{"$f":"SUMIFS('TRADE LOG'!$M$15:$M$9733,WL,\"W\",datecode,B45)","v":0},{"$f":"SUMIFS('TRADE LOG'!$M$15:$M$9733,WL,\"L\",datecode,B45)","v":0},0,{"v":54271.420000000006,"d":"$54,271.4"},0,0,null,0,"","","","","","",{"$f":"IFERROR(SUMIFS('TRADE LOG'!$W$15:$W$9733,datecode,\"=\"&B45),\"\")","v":{"v":0,"d":"0.00R"}},null,null,44075,54271.420000000006,44075,{"$f":"SUMIFS(BuyAmount,datecode,\"=\"&'MONTHLY REPORT'!B45)","v":0},0,0,{"$nulls":3},0,0,{"$nulls":13},{"$error":"#DIV/0!"},{"$error":"#DIV/0!"},0,0]
[32,"2020-08-01",{"$f":"SUMIFS('Bank Transfers'!$H$15:$H$514,'Bank Transfers'!$L$15:$L$514,B46,'Bank Transfers'!$E$15:$E$514,\"deposit\")","v":0},{"$f":"SUMIFS('Bank Transfers'!$H$15:$H$514,'Bank Transfers'!$L$15:$L$514,B46,'Bank Transfers'!$E$15:$E$514,\"withdraw\")","v":0},{"$f":"IF(B46=\"\",\"\",IF(B46='Bank Transfers'!$L$15,'Bank Transfers'!$H$15,J47))","v":{"v":54271.420000000006,"d":"$54,271.4"}},{"$f":"IFERROR(IF(B46='Bank Transfers'!$L$15,C46+D46-E46,C46+D46),0)","v":0},{"$f":"SUMIFS('TRADE LOG'!$M$15:$M$9733,WL,\"W\",datecode,B46)","v":0},{"$f":"SUMIFS('TRADE LOG'!$M$15:$M$9733,WL,\"L\",datecode,B46)","v":0},0,{"v":54271.420000000006,"d":"$54,271.4"},0,0,null,0,"","","","","","",{"$f":"IFERROR(SUMIFS('TRADE LOG'!$W$15:$W$9733,datecode,\"=\"&B46),\"\")","v":{"v":0,"d":"0.00R"}},null,null,44044,54271.420000000006,44044,{"$f":"SUMIFS(BuyAmount,datecode,\"=\"&'MONTHLY REPORT'!B46)","v":0},0,0,{"$nulls":3},0,0,{"$nulls":13},{"$error":"#DIV/0!"},{"$error":"#DIV/0!"},0,0]
[33,"2020-07-01",{"$f":"SUMIFS('Bank Transfers'!$H$15:$H$514,'Bank Transfers'!$L$15:$L$514,B47,'Bank Transfers'!$E$15:$E$514,\"deposit\")","v":0},{"$f":"SUMIFS('Bank Transfers'!$H$15:$H$514,'Bank Transfers'!$L$15:$L$514,B47,'Bank Transfers'!$E$15:$E$514,\"withdraw\")","v":0},{"$f":"IF(B47=\"\",\"\",IF(B47='Bank Transfers'!$L$15,'Bank Transfers'!$H$15,J48))","v":{"v":54271.420000000006,"d":"$54,271.4"}},{"$f":"IFERROR(IF(B47='Bank Transfers'!$L$15,C47+D47-E47,C47+D47),0)","v":0},{"$f":"SUMIFS('TRADE LOG'!$M$15:$M$9733,WL,\"W\",datecode,B47)","v":0},{"$f":"SUMIFS('TRADE LOG'!$M$15:$M$9733,WL,\"L\",datecode,B47)","v":0},0,{"v":54271.420000000006,"d":"$54,271.4"},0,0,null,{"$f":"IF(E47=\"\",\"\",AG47+AH47)","v":0},{"$f":"IFERROR(AG47/(AG47+AH47),\"\")","v":""},"","","","",{"$f":"IFERROR((AV47*AF47)/(AW47*(1-AF47)),\"\")","v":""},{"$f":"IFERROR(SUMIFS('TRADE LOG'!$W$15:$W$9733,datecode,\"=\"&B47),\"\")","v":{"v":0,"d":"0.00R"}},null,null,44013,54271.420000000006,{"$f":"B47","v":44013},{"$f":"SUMIFS(BuyAmount,datecode,\"=\"&'MONTHLY REPORT'!B47)","v":0},{"$f":"IF(L47>0,AA47,0)","v":0},0,{"$nulls":3},0,0,{"$nulls":13},{"$f":"AX47/AG47","v":{"$error":"#DIV/0!"}},{"$f":"-AY47/AH47","v":{"$error":"#DIV/0!"}},0,0]
[{"$f":"A47+1","v":34},"2020-06-01",{"$f":"SUMIFS('Bank Transfers'!$H$15:$H$514,'Bank Transfers'!$L$15:$L$514,B48,'Bank Transfers'!$E$15:$E$514,\"deposit\")","v":0},{"$f":"SUMIFS('Bank Transfers'!$H$15:$H$514,'Bank Transfers'!$L$15:$L$514,B48,'Bank Transfers'!$E$15:$E$514,\"withdraw\")","v":0},{"$f":"IF(B48=\"\",\"\",IF(B48='Bank Transfers'!$L$15,'Bank Transfers'!$H$15,J49))","v":{"v":53892.770000000004,"d":"$53,892.8"}},{"$f":"IFERROR(IF(B48='Bank Transfers'!$L$15,C48+D48-E48,C48+D48),0)","v":0},{"$f":"SUMIFS('TRADE LOG'!$M$15:$M$9733,WL,\"W\",datecode,B48)","v":{"v":2320,"d":"$2,320.0"}},{"$f":"SUMIFS('TRADE LOG'!$M$15:$M$9733,WL,\"L\",datecode,B48)","v":{"v":-1219.9,"d":"$-1,219.9"}},{"v":-721.4499999999999,"d":"$-721.5"},{"v":54271.420000000006,"d":"$54,271.4"},{"v":378.65,"d":"$378.7"},{"v":0.007025988829299365,"d":"▲ 0.70%"},null,13,{"v":0.3076923076923077,"d":"30.8%"},{"v":0.07376992447203196,"d":"7.4%"},{"v":-0.015257450125833353,"d":"-1.5%"},{"v":4.835010035335291,"d":"4.8"},{"v":2.7466408231076405,"d":"2.7"},{"v":0,"d":"0.0"},{"$f":"IFERROR(SUMIFS('TRADE LOG'!$W$15:$W$9733,datecode,\"=\"&B48),\"\")","v":{"v":0.7230773503617998,"d":"0.72R"}},null,null,43983,54271.420000000006,43983,{"$f":"SUMIFS(BuyAmount,datecode,\"=\"&'MONTHLY REPORT'!B48)","v":4447446.095650367},4447446.095650367,0,{"$nulls":3},4,9,{"$nulls":13},523.5250000000001,190.60555555555553,2094.1000000000004,-1715.4499999999998]
[35,"2020-05-01",{"$f":"SUMIFS('Bank Transfers'!$H$15:$H$514,'Bank Transfers'!$L$15:$L$514,B49,'Bank Transfers'!$E$15:$E$514,\"deposit\")","v":50000},{"$f":"SUMIFS('Bank Transfers'!$H$15:$H$514,'Bank Transfers'!$L$15:$L$514,B49,'Bank Transfers'!$E$15:$E$514,\"withdraw\")","v":0},{"$f":"IF(B49=\"\",\"\",IF(B49='Bank Transfers'!$L$15,'Bank Transfers'!$H$15,J50))","v":{"v":50000,"d":"$50,000.0"}},{"$f":"IFERROR(IF(B49='Bank Transfers'!$L$15,C49+D49-E49,C49+D49),0)","v":0},{"$f":"SUMIFS('TRADE LOG'!$M$15:$M$9733,WL,\"W\",datecode,B49)","v":{"v":13826.939999999999,"d":"$13,826.9"}},{"$f":"SUMIFS('TRADE LOG'!$M$15:$M$9733,WL,\"L\",datecode,B49)","v":{"v":-5694.78,"d":"$-5,694.8"}},{"v":-4239.389999999999,"d":"$-4,239.4"},{"v":53892.770000000004,"d":"$53,892.8"},{"v":3892.7699999999995,"d":"$3,892.8"},{"v":0.07785539999999999,"d":"▲ 7.79%"},null,42,{"v":0.5,"d":"50.0%"},{"v":0.0671426867076917,"d":"6.7%"},{"v":-0.057059676497423745,"d":"-5.7%"},{"v":1.1767099084538835,"d":"1.2"},{"v":1.4979087364931238,"d":"1.5"},{"v":0,"d":"0.0"},{"$f":"IFERROR(SUMIFS('TRADE LOG'!$W$15:$W$9733,datecode,\"=\"&B49),\"\")","v":{"v":7.798368179128246,"d":"7.80R"}},null,null,{"$f":"EOMONTH(X48,-2)+1","v":43952},53892.770000000004,43952,{"$f":"SUMIFS(BuyAmount,datecode,\"=\"&'MONTHLY REPORT'!B49)","v":1403330.5926931622},1403330.5926931622,0,{"$nulls":3},21,21,{"$nulls":13},557.6671428571428,372.29714285714283,11711.01,-7818.24]
[36,"",{"$f":"SUMIFS('Bank Transfers'!$H$15:$H$514,'Bank Transfers'!$L$15:$L$514,B50,'Bank Transfers'!$E$15:$E$514,\"deposit\")","v":0},{"$f":"SUMIFS('Bank Transfers'!$H$15:$H$514,'Bank Transfers'!$L$15:$L$514,B50,'Bank Transfers'!$E$15:$E$514,\"withdraw\")","v":0},{"$f":"IF(B50=\"\",\"\",IF(B50='Bank Transfers'!$L$15,'Bank Transfers'!$H$15,J51))","v":""},{"$f":"IFERROR(IF(B50='Bank Transfers'!$L$15,C50+D50-E50,C50+D50),0)","v":0},{"$f":"SUMIFS('TRADE LOG'!$M$15:$M$9733,WL,\"W\",datecode,B50)","v":0},{"$f":"SUMIFS('TRADE LOG'!$M$15:$M$9733,WL,\"L\",datecode,B50)","v":0},0,0,0,"",null,"","","","","","","",{"$f":"IFERROR(SUMIFS('TRADE LOG'!$W$15:$W$9733,datecode,\"=\"&B50),\"\")","v":{"v":0,"d":"0.00R"}},null,null,43922,{"$error":"#N/A"},"",{"$f":"SUMIFS(BuyAmount,datecode,\"=\"&'MONTHLY REPORT'!B50)","v":0},0,0,{"$nulls":3},0,0,{"$nulls":13},{"$error":"#DIV/0!"},{"$error":"#DIV/0!"},0,0]
{"$rows_empty":39}
[{"$nulls":25},{"$f":"#REF!","v":{"$error":"#REF!"}}]

{"sheet":"CALENDAR","index":7,"n_rows":256,"n_cols":9,"rows_kept":256,"hidden":true}
[]
[null,null,"Starting Month","Year"]
[null,null,"May",2020]
[]
[]
[null,null,{"$f":"DATEVALUE(\"1\"&C3&D3)","v":"2020-05-01"}]
[null,null,"SUN","MON","TUE","WED","THU","FRI","SAT"]
[null,null,{"$f":"IF(MONTH(C6)<>MONTH((C6-WEEKDAY(C6,1)+1)),\"\",(C6-WEEKDAY(C6,1)+1))","v":""},{"$f":"IF(MONTH(C6)<>MONTH((C6-WEEKDAY(C6,1)+2)),\"\",(C6-WEEKDAY(C6,1)+2))","v":""},{"$f":"IF(MONTH(C6)<>MONTH((C6-WEEKDAY(C6,1)+3)),\"\",(C6-WEEKDAY(C6,1)+3))","v":""},{"$f":"IF(MONTH(C6)<>MONTH((C6-WEEKDAY(C6,1)+4)),\"\",(C6-WEEKDAY(C6,1)+4))","v":""},{"$f":"IF(MONTH(C6)<>MONTH((C6-WEEKDAY(C6,1)+5)),\"\",(C6-WEEKDAY(C6,1)+5))","v":""},{"$f":"IF(MONTH(C6)<>MONTH((C6-WEEKDAY(C6,1)+6)),\"\",(C6-WEEKDAY(C6,1)+6))","v":"2020-05-01"},{"$f":"IF(MONTH(C6)<>MONTH((C6-WEEKDAY(C6,1)+7)),\"\",(C6-WEEKDAY(C6,1)+7))","v":"2020-05-02"}]
[null,null,{"$f":"SUMIFS('TRADE LOG'!$T$15:$T$9733,closeDate,\">\"&CALENDAR!C8,closeDate,\"<=\"&D8,SIZE,\">0\")","v":0},{"$f":"SUMIFS('TRADE LOG'!$T$15:$T$9733,closeDate,\">\"&CALENDAR!D8,closeDate,\"<=\"&E8,SIZE,\">0\")","v":0},{"$f":"SUMIFS('TRADE LOG'!$T$15:$T$9733,closeDate,\">\"&CALENDAR!E8,closeDate,\"<=\"&F8,SIZE,\">0\")","v":0},{"$f":"SUMIFS('TRADE LOG'!$T$15:$T$9733,closeDate,\">\"&CALENDAR!F8,closeDate,\"<=\"&G8,SIZE,\">0\")","v":0},{"$f":"SUMIFS('TRADE LOG'!$T$15:$T$9733,closeDate,\">\"&CALENDAR!G8,closeDate,\"<=\"&H8,SIZE,\">0\")","v":0},{"$f":"SUMIFS('TRADE LOG'!$T$15:$T$9733,closeDate,\">\"&CALENDAR!H8,closeDate,\"<=\"&I8,SIZE,\">0\")","v":0},{"$f":"SUMIFS('TRADE LOG'!$T$15:$T$9733,closeDate,\">\"&CALENDAR!I8,closeDate,\"<=\"&C11,SIZE,\">0\")","v":0}]
[null,null,{"$f":"COUNTIFS(closeDate,\">\"&CALENDAR!C8,closeDate,\"<=\"&D8,SIZE,\">0\")","v":0},{"$f":"COUNTIFS(closeDate,\">\"&CALENDAR!D8,closeDate,\"<=\"&E8,SIZE,\">0\")","v":0},{"$f":"COUNTIFS(closeDate,\">\"&CALENDAR!E8,closeDate,\"<=\"&F8,SIZE,\">0\")","v":0},{"$f":"COUNTIFS(closeDate,\">\"&CALENDAR!F8,closeDate,\"<=\"&G8,SIZE,\">0\")","v":0},{"$f":"COUNTIFS(closeDate,\">\"&CALENDAR!G8,closeDate,\"<=\"&H8,SIZE,\">0\")","v":0},{"$f":"COUNTIFS(closeDate,\">\"&CALENDAR!H8,closeDate,\"<=\"&I8,SIZE,\">0\")","v":0},{"$f":"COUNTIFS(closeDate,\">\"&CALENDAR!I8,closeDate,\"<=\"&(I8+1),SIZE,\">0\")","v":0}]
[null,null,{"$f":"I8+1","v":"2020-05-03"},{"$f":"C11+1","v":"2020-05-04"},{"$f":"D11+1","v":"2020-05-05"},"2020-05-06","2020-05-07","2020-05-08","2020-05-09"]
[null,null,{"$f":"SUMIFS('TRADE LOG'!$T$15:$T$9733,closeDate,\">\"&CALENDAR!C11,closeDate,\"<=\"&D11,SIZE,\">0\")","v":0},{"$f":"SUMIFS('TRADE LOG'!$T$15:$T$9733,closeDate,\">\"&CALENDAR!D11,closeDate,\"<=\"&E11,SIZE,\">0\")","v":0},{"$f":"SUMIFS('TRADE LOG'!$T$15:$T$9733,closeDate,\">\"&CALENDAR!E11,closeDate,\"<=\"&F11,SIZE,\">0\")","v":0},{"$f":"SUMIFS('TRADE LOG'!$T$15:$T$9733,closeDate,\">\"&CALENDAR!F11,closeDate,\"<=\"&G11,SIZE,\">0\")","v":0},{"$f":"SUMIFS('TRADE LOG'!$T$15:$T$9733,closeDate,\">\"&CALENDAR!G11,closeDate,\"<=\"&H11,SIZE,\">0\")","v":0},{"$f":"SUMIFS('TRADE LOG'!$T$15:$T$9733,closeDate,\">\"&CALENDAR!H11,closeDate,\"<=\"&I11,SIZE,\">0\")","v":0},{"$f":"SUMIFS('TRADE LOG'!$T$15:$T$9733,closeDate,\">\"&CALENDAR!I11,closeDate,\"<=\"&C14,SIZE,\">0\")","v":0}]
[null,null,{"$f":"COUNTIFS(closeDate,\">\"&CALENDAR!C11,closeDate,\"<=\"&D11,SIZE,\">0\")","v":0},{"$f":"COUNTIFS(closeDate,\">\"&CALENDAR!D11,closeDate,\"<=\"&E11,SIZE,\">0\")","v":0},{"$f":"COUNTIFS(closeDate,\">\"&CALENDAR!E11,closeDate,\"<=\"&F11,SIZE,\">0\")","v":0},{"$f":"COUNTIFS(closeDate,\">\"&CALENDAR!F11,closeDate,\"<=\"&G11,SIZE,\">0\")","v":0},{"$f":"COUNTIFS(closeDate,\">\"&CALENDAR!G11,closeDate,\"<=\"&H11,SIZE,\">0\")","v":0},{"$f":"COUNTIFS(closeDate,\">\"&CALENDAR!H11,closeDate,\"<=\"&I11,SIZE,\">0\")","v":0},{"$f":"COUNTIFS(closeDate,\">\"&CALENDAR!I11,closeDate,\"<=\"&(I11+1),SIZE,\">0\")","v":0}]
[null,null,{"$f":"I11+1","v":"2020-05-10"},{"$f":"C14+1","v":"2020-05-11"},"2020-05-12","2020-05-13","2020-05-14","2020-05-15","2020-05-16"]
[null,null,{"$f":"SUMIFS('TRADE LOG'!$T$15:$T$9733,closeDate,\">\"&CALENDAR!C14,closeDate,\"<=\"&D14,SIZE,\">0\")","v":0},{"$f":"SUMIFS('TRADE LOG'!$T$15:$T$9733,closeDate,\">\"&CALENDAR!D14,closeDate,\"<=\"&E14,SIZE,\">0\")","v":0},{"$f":"SUMIFS('TRADE LOG'!$T$15:$T$9733,closeDate,\">\"&CALENDAR!E14,closeDate,\"<=\"&F14,SIZE,\">0\")","v":0},{"$f":"SUMIFS('TRADE LOG'!$T$15:$T$9733,closeDate,\">\"&CALENDAR!F14,closeDate,\"<=\"&G14,SIZE,\">0\")","v":0},{"$f":"SUMIFS('TRADE LOG'!$T$15:$T$9733,closeDate,\">\"&CALENDAR!G14,closeDate,\"<=\"&H14,SIZE,\">0\")","v":0},{"$f":"SUMIFS('TRADE LOG'!$T$15:$T$9733,closeDate,\">\"&CALENDAR!H14,closeDate,\"<=\"&I14,SIZE,\">0\")","v":0},{"$f":"SUMIFS('TRADE LOG'!$T$15:$T$9733,closeDate,\">\"&CALENDAR!I14,closeDate,\"<=\"&C17,SIZE,\">0\")","v":0}]
[null,null,{"$f":"COUNTIFS(closeDate,\">\"&CALENDAR!C14,closeDate,\"<=\"&D14,SIZE,\">0\")","v":0},{"$f":"COUNTIFS(closeDate,\">\"&CALENDAR!D14,closeDate,\"<=\"&E14,SIZE,\">0\")","v":0},{"$f":"COUNTIFS(closeDate,\">\"&CALENDAR!E14,closeDate,\"<=\"&F14,SIZE,\">0\")","v":0},{"$f":"COUNTIFS(closeDate,\">\"&CALENDAR!F14,closeDate,\"<=\"&G14,SIZE,\">0\")","v":0},{"$f":"COUNTIFS(closeDate,\">\"&CALENDAR!G14,closeDate,\"<=\"&H14,SIZE,\">0\")","v":0},{"$f":"COUNTIFS(closeDate,\">\"&CALENDAR!H14,closeDate,\"<=\"&I14,SIZE,\">0\")","v":0},{"$f":"COUNTIFS(closeDate,\">\"&CALENDAR!I14,closeDate,\"<=\"&(I14+1),SIZE,\">0\")","v":0}]
[null,null,{"$f":"I14+1","v":"2020-05-17"},{"$f":"C17+1","v":"2020-05-18"},"2020-05-19","2020-05-20","2020-05-21","2020-05-22","2020-05-23"]
[null,null,{"$f":"SUMIFS('TRADE LOG'!$T$15:$T$9733,closeDate,\">\"&CALENDAR!C17,closeDate,\"<=\"&D17,SIZE,\">0\")","v":0},{"$f":"SUMIFS('TRADE LOG'!$T$15:$T$9733,closeDate,\">\"&CALENDAR!D17,closeDate,\"<=\"&E17,SIZE,\">0\")","v":0},{"$f":"SUMIFS('TRADE LOG'!$T$15:$T$9733,closeDate,\">\"&CALENDAR!E17,closeDate,\"<=\"&F17,SIZE,\">0\")","v":0},{"$f":"SUMIFS('TRADE LOG'!$T$15:$T$9733,closeDate,\">\"&CALENDAR!F17,closeDate,\"<=\"&G17,SIZE,\">0\")","v":0},{"$f":"SUMIFS('TRADE LOG'!$T$15:$T$9733,closeDate,\">\"&CALENDAR!G17,closeDate,\"<=\"&H17,SIZE,\">0\")","v":0},{"$f":"SUMIFS('TRADE LOG'!$T$15:$T$9733,closeDate,\">\"&CALENDAR!H17,closeDate,\"<=\"&I17,SIZE,\">0\")","v":0},{"$f":"SUMIFS('TRADE LOG'!$T$15:$T$9733,closeDate,\">\"&CALENDAR!I17,closeDate,\"<=\"&C20,SIZE,\">0\")","v":0}]
[null,null,{"$f":"COUNTIFS(closeDate,\">\"&CALENDAR!C17,closeDate,\"<=\"&D17,SIZE,\">0\")","v":0},{"$f":"COUNTIFS(closeDate,\">\"&CALENDAR!D17,closeDate,\"<=\"&E17,SIZE,\">0\")","v":0},{"$f":"COUNTIFS(closeDate,\">\"&CALENDAR!E17,closeDate,\"<=\"&F17,SIZE,\">0\")","v":0},{"$f":"COUNTIFS(closeDate,\">\"&CALENDAR!F17,closeDate,\"<=\"&G17,SIZE,\">0\")","v":0},{"$f":"COUNTIFS(closeDate,\">\"&CALENDAR!G17,closeDate,\"<=\"&H17,SIZE,\">0\")","v":0},{"$f":"COUNTIFS(closeDate,\">\"&CALENDAR!H17,closeDate,\"<=\"&I17,SIZE,\">0\")","v":0},{"$f":"COUNTIFS(closeDate,\">\"&CALENDAR!I17,closeDate,\"<=\"&(I17+1),SIZE,\">0\")","v":0}]
[null,null,{"$f":"IFERROR(IF(MONTH(C6)<>MONTH(I17+1),\"\",(I17+1)),\"\")","v":"2020-05-24"},{"$f":"IFERROR(IF(MONTH(C6)<>MONTH(C20+1),\"\",(C20+1)),\"\")","v":"2020-05-25"},{"$f":"IFERROR(IF(MONTH(C6)<>MONTH(D20+1),\"\",(D20+1)),\"\")","v":"2020-05-26"},{"$f":"IFERROR(IF(MONTH(C6)<>MONTH(E20+1),\"\",(E20+1)),\"\")","v":"2020-05-27"},{"$f":"IFERROR(IF(MONTH(C6)<>MONTH(F20+1),\"\",(F20+1)),\"\")","v":"2020-05-28"},{"$f":"IFERROR(IF(MONTH(C6)<>MONTH(G20+1),\"\",(G20+1)),\"\")","v":"2020-05-29"},{"$f":"IFERROR(IF(MONTH(C6)<>MONTH(H20+1),\"\",(H20+1)),\"\")","v":"2020-05-30"}]
[null,null,{"$f":"SUMIFS('TRADE LOG'!$T$15:$T$9733,closeDate,\">\"&CALENDAR!C20,closeDate,\"<=\"&D20,SIZE,\">0\")","v":0},{"$f":"SUMIFS('TRADE LOG'!$T$15:$T$9733,closeDate,\">\"&CALENDAR!D20,closeDate,\"<=\"&E20,SIZE,\">0\")","v":0},{"$f":"SUMIFS('TRADE LOG'!$T$15:$T$9733,closeDate,\">\"&CALENDAR!E20,closeDate,\"<=\"&F20,SIZE,\">0\")","v":0},{"$f":"SUMIFS('TRADE LOG'!$T$15:$T$9733,closeDate,\">\"&CALENDAR!F20,closeDate,\"<=\"&G20,SIZE,\">0\")","v":{"v":-467.65,"d":"$ -467.7"}},{"$f":"SUMIFS('TRADE LOG'!$T$15:$T$9733,closeDate,\">\"&CALENDAR!G20,closeDate,\"<=\"&H20,SIZE,\">0\")","v":{"v":2872.9600000000005,"d":"$ 2,873.0"}},{"$f":"SUMIFS('TRADE LOG'!$T$15:$T$9733,closeDate,\">\"&CALENDAR!H20,closeDate,\"<=\"&I20,SIZE,\">0\")","v":{"v":1487.46,"d":"$ 1,487.5"}},{"$f":"SUMIFS('TRADE LOG'!$T$15:$T$9733,closeDate,\">\"&CALENDAR!I20,closeDate,\"<=\"&C23,SIZE,\">0\")","v":0}]
[null,null,{"$f":"COUNTIFS(closeDate,\">\"&CALENDAR!C20,closeDate,\"<=\"&D20,SIZE,\">0\")","v":0},{"$f":"COUNTIFS(closeDate,\">\"&CALENDAR!D20,closeDate,\"<=\"&E20,SIZE,\">0\")","v":0},{"$f":"COUNTIFS(closeDate,\">\"&CALENDAR!E20,closeDate,\"<=\"&F20,SIZE,\">0\")","v":0},{"$f":"COUNTIFS(closeDate,\">\"&CALENDAR!F20,closeDate,\"<=\"&G20,SIZE,\">0\")","v":{"v":2,"d":"2 Trades"}},{"$f":"COUNTIFS(closeDate,\">\"&CALENDAR!G20,closeDate,\"<=\"&H20,SIZE,\">0\")","v":{"v":28,"d":"28 Trades"}},{"$f":"COUNTIFS(closeDate,\">\"&CALENDAR!H20,closeDate,\"<=\"&I20,SIZE,\">0\")","v":{"v":12,"d":"12 Trades"}},{"$f":"COUNTIFS(closeDate,\">\"&CALENDAR!I20,closeDate,\"<=\"&(I20+1),SIZE,\">0\")","v":0}]
[null,null,{"$f":"IFERROR(IF(MONTH(C6)<>MONTH(I20+1),\"\",(I20+1)),\"\")","v":"2020-05-31"},{"$f":"IFERROR(IF(MONTH(C6)<>MONTH(C23+1),\"\",(C23+1)),\"\")","v":""},{"$f":"IFERROR(IF(MONTH(C6)<>MONTH(D23+1),\"\",(D23+1)),\"\")","v":""},{"$f":"IFERROR(IF(MONTH(C6)<>MONTH(E23+1),\"\",(E23+1)),\"\")","v":""},{"$f":"IFERROR(IF(MONTH(C6)<>MONTH(F23+1),\"\",(F23+1)),\"\")","v":""},{"$f":"IFERROR(IF(MONTH(C6)<>MONTH(G23+1),\"\",(G23+1)),\"\")","v":""},{"$f":"IFERROR(IF(MONTH(C6)<>MONTH(H23+1),\"\",(H23+1)),\"\")","v":""}]
[null,null,{"$f":"SUMIFS('TRADE LOG'!$T$15:$T$9733,closeDate,\">\"&CALENDAR!C23,closeDate,\"<=\"&D23,SIZE,\">0\")","v":0},{"$f":"SUMIFS('TRADE LOG'!$T$15:$T$9733,closeDate,\">\"&CALENDAR!D23,closeDate,\"<=\"&E23,SIZE,\">0\")","v":0},{"$f":"SUMIFS('TRADE LOG'!$T$15:$T$9733,closeDate,\">\"&CALENDAR!E23,closeDate,\"<=\"&F23,SIZE,\">0\")","v":0},{"$f":"SUMIFS('TRADE LOG'!$T$15:$T$9733,closeDate,\">\"&CALENDAR!F23,closeDate,\"<=\"&G23,SIZE,\">0\")","v":0},{"$f":"SUMIFS('TRADE LOG'!$T$15:$T$9733,closeDate,\">\"&CALENDAR!G23,closeDate,\"<=\"&H23,SIZE,\">0\")","v":0},{"$f":"SUMIFS('TRADE LOG'!$T$15:$T$9733,closeDate,\">\"&CALENDAR!H23,closeDate,\"<=\"&I23,SIZE,\">0\")","v":0},{"$f":"SUMIFS('TRADE LOG'!$T$15:$T$9733,closeDate,\">\"&CALENDAR!I23,closeDate,\"<=\"&C26,SIZE,\">0\")","v":0}]
[null,null,{"$f":"COUNTIFS(closeDate,\">\"&CALENDAR!C23,closeDate,\"<=\"&D23,SIZE,\">0\")","v":0},{"$f":"COUNTIFS(closeDate,\">\"&CALENDAR!D23,closeDate,\"<=\"&E23,SIZE,\">0\")","v":0},{"$f":"COUNTIFS(closeDate,\">\"&CALENDAR!E23,closeDate,\"<=\"&F23,SIZE,\">0\")","v":0},{"$f":"COUNTIFS(closeDate,\">\"&CALENDAR!F23,closeDate,\"<=\"&G23,SIZE,\">0\")","v":0},{"$f":"COUNTIFS(closeDate,\">\"&CALENDAR!G23,closeDate,\"<=\"&H23,SIZE,\">0\")","v":0},{"$f":"COUNTIFS(closeDate,\">\"&CALENDAR!H23,closeDate,\"<=\"&I23,SIZE,\">0\")","v":0},{"$f":"COUNTIFS(closeDate,\">\"&CALENDAR!I23,closeDate,\"<=\"&(I23+1),SIZE,\">0\")","v":0}]
[]
[null,null,{"$f":"EOMONTH(C6,0)+1","v":"2020-06-01"}]
[null,null,"SUN","MON","TUE","WED","THU","FRI","SAT"]
[null,null,{"$f":"IF(MONTH(C27)<>MONTH((C27-WEEKDAY(C27,1)+1)),\"\",(C27-WEEKDAY(C27,1)+1))","v":""},{"$f":"IF(MONTH(C27)<>MONTH((C27-WEEKDAY(C27,1)+2)),\"\",(C27-WEEKDAY(C27,1)+2))","v":"2020-06-01"},{"$f":"IF(MONTH(C27)<>MONTH((C27-WEEKDAY(C27,1)+3)),\"\",(C27-WEEKDAY(C27,1)+3))","v":"2020-06-02"},{"$f":"IF(MONTH(C27)<>MONTH((C27-WEEKDAY(C27,1)+4)),\"\",(C27-WEEKDAY(C27,1)+4))","v":"2020-06-03"},{"$f":"IF(MONTH(C27)<>MONTH((C27-WEEKDAY(C27,1)+5)),\"\",(C27-WEEKDAY(C27,1)+5))","v":"2020-06-04"},{"$f":"IF(MONTH(C27)<>MONTH((C27-WEEKDAY(C27,1)+6)),\"\",(C27-WEEKDAY(C27,1)+6))","v":"2020-06-05"},{"$f":"IF(MONTH(C27)<>MONTH((C27-WEEKDAY(C27,1)+7)),\"\",(C27-WEEKDAY(C27,1)+7))","v":"2020-06-06"}]
[null,null,{"$f":"SUMIFS('TRADE LOG'!$T$15:$T$9733,closeDate,\">\"&CALENDAR!C29,closeDate,\"<=\"&D29,SIZE,\">0\")","v":0},{"$f":"SUMIFS('TRADE LOG'!$T$15:$T$9733,closeDate,\">\"&CALENDAR!D29,closeDate,\"<=\"&E29,SIZE,\">0\")","v":{"v":378.6500000000003,"d":"$ 378.7"}},{"$f":"SUMIFS('TRADE LOG'!$T$15:$T$9733,closeDate,\">\"&CALENDAR!E29,closeDate,\"<=\"&F29,SIZE,\">0\")","v":0},{"$f":"SUMIFS('TRADE LOG'!$T$15:$T$9733,closeDate,\">\"&CALENDAR!F29,closeDate,\"<=\"&G29,SIZE,\">0\")","v":0},{"$f":"SUMIFS('TRADE LOG'!$T$15:$T$9733,closeDate,\">\"&CALENDAR!G29,closeDate,\"<=\"&H29,SIZE,\">0\")","v":0},{"$f":"SUMIFS('TRADE LOG'!$T$15:$T$9733,closeDate,\">\"&CALENDAR!H29,closeDate,\"<=\"&I29,SIZE,\">0\")","v":0},{"$f":"SUMIFS('TRADE LOG'!$T$15:$T$9733,closeDate,\">\"&CALENDAR!I29,closeDate,\"<=\"&C32,SIZE,\">0\")","v":0}]
[null,null,{"$f":"COUNTIFS(closeDate,\">\"&CALENDAR!C29,closeDate,\"<=\"&D29,SIZE,\">0\")","v":0},{"$f":"COUNTIFS(closeDate,\">\"&CALENDAR!D29,closeDate,\"<=\"&E29,SIZE,\">0\")","v":{"v":13,"d":"13 Trades"}},{"$f":"COUNTIFS(closeDate,\">\"&CALENDAR!E29,closeDate,\"<=\"&F29,SIZE,\">0\")","v":0},{"$f":"COUNTIFS(closeDate,\">\"&CALENDAR!F29,closeDate,\"<=\"&G29,SIZE,\">0\")","v":0},{"$f":"COUNTIFS(closeDate,\">\"&CALENDAR!G29,closeDate,\"<=\"&H29,SIZE,\">0\")","v":0},{"$f":"COUNTIFS(closeDate,\">\"&CALENDAR!H29,closeDate,\"<=\"&I29,SIZE,\">0\")","v":0},{"$f":"COUNTIFS(closeDate,\">\"&CALENDAR!I29,closeDate,\"<=\"&(I29+1),SIZE,\">0\")","v":0}]
[null,null,{"$f":"I29+1","v":"2020-06-07"},{"$f":"C32+1","v":"2020-06-08"},{"$f":"D32+1","v":"2020-06-09"},{"$f":"E32+1","v":"2020-06-10"},{"$f":"F32+1","v":"2020-06-11"},{"$f":"G32+1","v":"2020-06-12"},{"$f":"H32+1","v":"2020-06-13"}]
[null,null,{"$f":"SUMIFS('TRADE LOG'!$T$15:$T$9733,closeDate,\">\"&CALENDAR!C32,closeDate,\"<=\"&D32,SIZE,\">0\")","v":0},{"$f":"SUMIFS('TRADE LOG'!$T$15:$T$9733,closeDate,\">\"&CALENDAR!D32,closeDate,\"<=\"&E32,SIZE,\">0\")","v":0},{"$f":"SUMIFS('TRADE LOG'!$T$15:$T$9733,closeDate,\">\"&CALENDAR!E32,closeDate,\"<=\"&F32,SIZE,\">0\")","v":0},{"$f":"SUMIFS('TRADE LOG'!$T$15:$T$9733,closeDate,\">\"&CALENDAR!F32,closeDate,\"<=\"&G32,SIZE,\">0\")","v":0},{"$f":"SUMIFS('TRADE LOG'!$T$15:$T$9733,closeDate,\">\"&CALENDAR!G32,closeDate,\"<=\"&H32,SIZE,\">0\")","v":0},{"$f":"SUMIFS('TRADE LOG'!$T$15:$T$9733,closeDate,\">\"&CALENDAR!H32,closeDate,\"<=\"&I32,SIZE,\">0\")","v":0},{"$f":"SUMIFS('TRADE LOG'!$T$15:$T$9733,closeDate,\">\"&CALENDAR!I32,closeDate,\"<=\"&C35,SIZE,\">0\")","v":0}]
[null,null,{"$f":"COUNTIFS(closeDate,\">\"&CALENDAR!C32,closeDate,\"<=\"&D32,SIZE,\">0\")","v":0},{"$f":"COUNTIFS(closeDate,\">\"&CALENDAR!D32,closeDate,\"<=\"&E32,SIZE,\">0\")","v":0},{"$f":"COUNTIFS(closeDate,\">\"&CALENDAR!E32,closeDate,\"<=\"&F32,SIZE,\">0\")","v":0},{"$f":"COUNTIFS(closeDate,\">\"&CALENDAR!F32,closeDate,\"<=\"&G32,SIZE,\">0\")","v":0},{"$f":"COUNTIFS(closeDate,\">\"&CALENDAR!G32,closeDate,\"<=\"&H32,SIZE,\">0\")","v":0},{"$f":"COUNTIFS(closeDate,\">\"&CALENDAR!H32,closeDate,\"<=\"&I32,SIZE,\">0\")","v":0},{"$f":"COUNTIFS(closeDate,\">\"&CALENDAR!I32,closeDate,\"<=\"&(I32+1),SIZE,\">0\")","v":0}]
[null,null,{"$f":"I32+1","v":"2020-06-14"},{"$f":"C35+1","v":"2020-06-15"},{"$f":"D35+1","v":"2020-06-16"},{"$f":"E35+1","v":"2020-06-17"},{"$f":"F35+1","v":"2020-06-18"},{"$f":"G35+1","v":"2020-06-19"},{"$f":"H35+1","v":"2020-06-20"}]
[null,null,{"$f":"SUMIFS('TRADE LOG'!$T$15:$T$9733,closeDate,\">\"&CALENDAR!C35,closeDate,\"<=\"&D35,SIZE,\">0\")","v":0},{"$f":"SUMIFS('TRADE LOG'!$T$15:$T$9733,closeDate,\">\"&CALENDAR!D35,closeDate,\"<=\"&E35,SIZE,\">0\")","v":0},{"$f":"SUMIFS('TRADE LOG'!$T$15:$T$9733,closeDate,\">\"&CALENDAR!E35,closeDate,\"<=\"&F35,SIZE,\">0\")","v":0},{"$f":"SUMIFS('TRADE LOG'!$T$15:$T$9733,closeDate,\">\"&CALENDAR!F35,closeDate,\"<=\"&G35,SIZE,\">0\")","v":0},{"$f":"SUMIFS('TRADE LOG'!$T$15:$T$9733,closeDate,\">\"&CALENDAR!G35,closeDate,\"<=\"&H35,SIZE,\">0\")","v":0},{"$f":"SUMIFS('TRADE LOG'!$T$15:$T$9733,closeDate,\">\"&CALENDAR!H35,closeDate,\"<=\"&I35,SIZE,\">0\")","v":0},{"$f":"SUMIFS('TRADE LOG'!$T$15:$T$9733,closeDate,\">\"&CALENDAR!I35,closeDate,\"<=\"&C38,SIZE,\">0\")","v":0}]
[null,null,{"$f":"COUNTIFS(closeDate,\">\"&CALENDAR!C35,closeDate,\"<=\"&D35,SIZE,\">0\")","v":0},{"$f":"COUNTIFS(closeDate,\">\"&CALENDAR!D35,closeDate,\"<=\"&E35,SIZE,\">0\")","v":0},{"$f":"COUNTIFS(closeDate,\">\"&CALENDAR!E35,closeDate,\"<=\"&F35,SIZE,\">0\")","v":0},{"$f":"COUNTIFS(closeDate,\">\"&CALENDAR!F35,closeDate,\"<=\"&G35,SIZE,\">0\")","v":0},{"$f":"COUNTIFS(closeDate,\">\"&CALENDAR!G35,closeDate,\"<=\"&H35,SIZE,\">0\")","v":0},{"$f":"COUNTIFS(closeDate,\">\"&CALENDAR!H35,closeDate,\"<=\"&I35,SIZE,\">0\")","v":0},{"$f":"COUNTIFS(closeDate,\">\"&CALENDAR!I35,closeDate,\"<=\"&(I35+1),SIZE,\">0\")","v":0}]
[null,null,{"$f":"I35+1","v":"2020-06-21"},{"$f":"C38+1","v":"2020-06-22"},{"$f":"D38+1","v":"2020-06-23"},{"$f":"E38+1","v":"2020-06-24"},{"$f":"F38+1","v":"2020-06-25"},{"$f":"G38+1","v":"2020-06-26"},{"$f":"H38+1","v":"2020-06-27"}]
[null,null,{"$f":"SUMIFS('TRADE LOG'!$T$15:$T$9733,closeDate,\">\"&CALENDAR!C38,closeDate,\"<=\"&D38,SIZE,\">0\")","v":0},{"$f":"SUMIFS('TRADE LOG'!$T$15:$T$9733,closeDate,\">\"&CALENDAR!D38,closeDate,\"<=\"&E38,SIZE,\">0\")","v":0},{"$f":"SUMIFS('TRADE LOG'!$T$15:$T$9733,closeDate,\">\"&CALENDAR!E38,closeDate,\"<=\"&F38,SIZE,\">0\")","v":0},{"$f":"SUMIFS('TRADE LOG'!$T$15:$T$9733,closeDate,\">\"&CALENDAR!F38,closeDate,\"<=\"&G38,SIZE,\">0\")","v":0},{"$f":"SUMIFS('TRADE LOG'!$T$15:$T$9733,closeDate,\">\"&CALENDAR!G38,closeDate,\"<=\"&H38,SIZE,\">0\")","v":0},{"$f":"SUMIFS('TRADE LOG'!$T$15:$T$9733,closeDate,\">\"&CALENDAR!H38,closeDate,\"<=\"&I38,SIZE,\">0\")","v":0},{"$f":"SUMIFS('TRADE LOG'!$T$15:$T$9733,closeDate,\">\"&CALENDAR!I38,closeDate,\"<=\"&C41,SIZE,\">0\")","v":0}]
[null,null,{"$f":"COUNTIFS(closeDate,\">\"&CALENDAR!C38,closeDate,\"<=\"&D38,SIZE,\">0\")","v":0},{"$f":"COUNTIFS(closeDate,\">\"&CALENDAR!D38,closeDate,\"<=\"&E38,SIZE,\">0\")","v":0},{"$f":"COUNTIFS(closeDate,\">\"&CALENDAR!E38,closeDate,\"<=\"&F38,SIZE,\">0\")","v":0},{"$f":"COUNTIFS(closeDate,\">\"&CALENDAR!F38,closeDate,\"<=\"&G38,SIZE,\">0\")","v":0},{"$f":"COUNTIFS(closeDate,\">\"&CALENDAR!G38,closeDate,\"<=\"&H38,SIZE,\">0\")","v":0},{"$f":"COUNTIFS(closeDate,\">\"&CALENDAR!H38,closeDate,\"<=\"&I38,SIZE,\">0\")","v":0},{"$f":"COUNTIFS(closeDate,\">\"&CALENDAR!I38,closeDate,\"<=\"&(I38+1),SIZE,\">0\")","v":0}]
[null,null,{"$f":"IFERROR(IF(MONTH(C27)<>MONTH(I38+1),\"\",(I38+1)),\"\")","v":"2020-06-28"},{"$f":"IFERROR(IF(MONTH(C27)<>MONTH(C41+1),\"\",(C41+1)),\"\")","v":"2020-06-29"},{"$f":"IFERROR(IF(MONTH(C27)<>MONTH(D41+1),\"\",(D41+1)),\"\")","v":"2020-06-30"},{"$f":"IFERROR(IF(MONTH(C27)<>MONTH(E41+1),\"\",(E41+1)),\"\")","v":""},{"$f":"IFERROR(IF(MONTH(C27)<>MONTH(F41+1),\"\",(F41+1)),\"\")","v":""},{"$f":"IFERROR(IF(MONTH(C27)<>MONTH(G41+1),\"\",(G41+1)),\"\")","v":""},{"$f":"IFERROR(IF(MONTH(C27)<>MONTH(H41+1),\"\",(H41+1)),\"\")","v":""}]
[null,null,{"$f":"SUMIFS('TRADE LOG'!$T$15:$T$9733,closeDate,\">\"&CALENDAR!C41,closeDate,\"<=\"&D41,SIZE,\">0\")","v":0},{"$f":"SUMIFS('TRADE LOG'!$T$15:$T$9733,closeDate,\">\"&CALENDAR!D41,closeDate,\"<=\"&E41,SIZE,\">0\")","v":0},{"$f":"SUMIFS('TRADE LOG'!$T$15:$T$9733,closeDate,\">\"&CALENDAR!E41,closeDate,\"<=\"&F41,SIZE,\">0\")","v":0},{"$f":"SUMIFS('TRADE LOG'!$T$15:$T$9733,closeDate,\">\"&CALENDAR!F41,closeDate,\"<=\"&G41,SIZE,\">0\")","v":0},{"$f":"SUMIFS('TRADE LOG'!$T$15:$T$9733,closeDate,\">\"&CALENDAR!G41,closeDate,\"<=\"&H41,SIZE,\">0\")","v":0},{"$f":"SUMIFS('TRADE LOG'!$T$15:$T$9733,closeDate,\">\"&CALENDAR!H41,closeDate,\"<=\"&I41,SIZE,\">0\")","v":0},{"$f":"SUMIFS('TRADE LOG'!$T$15:$T$9733,closeDate,\">\"&CALENDAR!I41,closeDate,\"<=\"&C44,SIZE,\">0\")","v":0}]
[null,null,{"$f":"COUNTIFS(closeDate,\">\"&CALENDAR!C41,closeDate,\"<=\"&D41,SIZE,\">0\")","v":0},{"$f":"COUNTIFS(closeDate,\">\"&CALENDAR!D41,closeDate,\"<=\"&E41,SIZE,\">0\")","v":0},{"$f":"COUNTIFS(closeDate,\">\"&CALENDAR!E41,closeDate,\"<=\"&F41,SIZE,\">0\")","v":0},{"$f":"COUNTIFS(closeDate,\">\"&CALENDAR!F41,closeDate,\"<=\"&G41,SIZE,\">0\")","v":0},{"$f":"COUNTIFS(closeDate,\">\"&CALENDAR!G41,closeDate,\"<=\"&H41,SIZE,\">0\")","v":0},{"$f":"COUNTIFS(closeDate,\">\"&CALENDAR!H41,closeDate,\"<=\"&I41,SIZE,\">0\")","v":0},{"$f":"COUNTIFS(closeDate,\">\"&CALENDAR!I41,closeDate,\"<=\"&(I41+1),SIZE,\">0\")","v":0}]
[null,null,{"$f":"IFERROR(IF(MONTH(C27)<>MONTH(I41+1),\"\",(I41+1)),\"\")","v":""},{"$f":"IFERROR(IF(MONTH(C27)<>MONTH(C44+1),\"\",(C44+1)),\"\")","v":""},{"$f":"IFERROR(IF(MONTH(C27)<>MONTH(D44+1),\"\",(D44+1)),\"\")","v":""},{"$f":"IFERROR(IF(MONTH(C27)<>MONTH(E44+1),\"\",(E44+1)),\"\")","v":""},{"$f":"IFERROR(IF(MONTH(C27)<>MONTH(F44+1),\"\",(F44+1)),\"\")","v":""},{"$f":"IFERROR(IF(MONTH(C27)<>MONTH(G44+1),\"\",(G44+1)),\"\")","v":""},{"$f":"IFERROR(IF(MONTH(C27)<>MONTH(H44+1),\"\",(H44+1)),\"\")","v":""}]
[null,null,{"$f":"SUMIFS('TRADE LOG'!$T$15:$T$9733,closeDate,\">\"&CALENDAR!C44,closeDate,\"<=\"&D44,SIZE,\">0\")","v":0},{"$f":"SUMIFS('TRADE LOG'!$T$15:$T$9733,closeDate,\">\"&CALENDAR!D44,closeDate,\"<=\"&E44,SIZE,\">0\")","v":0},{"$f":"SUMIFS('TRADE LOG'!$T$15:$T$9733,closeDate,\">\"&CALENDAR!E44,closeDate,\"<=\"&F44,SIZE,\">0\")","v":0},{"$f":"SUMIFS('TRADE LOG'!$T$15:$T$9733,closeDate,\">\"&CALENDAR!F44,closeDate,\"<=\"&G44,SIZE,\">0\")","v":0},{"$f":"SUMIFS('TRADE LOG'!$T$15:$T$9733,closeDate,\">\"&CALENDAR!G44,closeDate,\"<=\"&H44,SIZE,\">0\")","v":0},{"$f":"SUMIFS('TRADE LOG'!$T$15:$T$9733,closeDate,\">\"&CALENDAR!H44,closeDate,\"<=\"&I44,SIZE,\">0\")","v":0},{"$f":"SUMIFS('TRADE LOG'!$T$15:$T$9733,closeDate,\">\"&CALENDAR!I44,closeDate,\"<=\"&C47,SIZE,\">0\")","v":0}]
[null,null,{"$f":"COUNTIFS(closeDate,\">\"&CALENDAR!C44,closeDate,\"<=\"&D44,SIZE,\">0\")","v":0},{"$f":"COUNTIFS(closeDate,\">\"&CALENDAR!D44,closeDate,\"<=\"&E44,SIZE,\">0\")","v":0},{"$f":"COUNTIFS(closeDate,\">\"&CALENDAR!E44,closeDate,\"<=\"&F44,SIZE,\">0\")","v":0},{"$f":"COUNTIFS(closeDate,\">\"&CALENDAR!F44,closeDate,\"<=\"&G44,SIZE,\">0\")","v":0},{"$f":"COUNTIFS(closeDate,\">\"&CALENDAR!G44,closeDate,\"<=\"&H44,SIZE,\">0\")","v":0},{"$f":"COUNTIFS(closeDate,\">\"&CALENDAR!H44,closeDate,\"<=\"&I44,SIZE,\">0\")","v":0},{"$f":"COUNTIFS(closeDate,\">\"&CALENDAR!I44,closeDate,\"<=\"&(I44+1),SIZE,\">0\")","v":0}]
[]
[null,null,{"$f":"EOMONTH(C27,0)+1","v":"2020-07-01"}]
[null,null,"SUN","MON","TUE","WED","THU","FRI","SAT"]
[null,null,{"$f":"IF(MONTH(C48)<>MONTH((C48-WEEKDAY(C48,1)+1)),\"\",(C48-WEEKDAY(C48,1)+1))","v":""},{"$f":"IF(MONTH(C48)<>MONTH((C48-WEEKDAY(C48,1)+2)),\"\",(C48-WEEKDAY(C48,1)+2))","v":""},{"$f":"IF(MONTH(C48)<>MONTH((C48-WEEKDAY(C48,1)+3)),\"\",(C48-WEEKDAY(C48,1)+3))","v":""},{"$f":"IF(MONTH(C48)<>MONTH((C48-WEEKDAY(C48,1)+4)),\"\",(C48-WEEKDAY(C48,1)+4))","v":"2020-07-01"},{"$f":"IF(MONTH(C48)<>MONTH((C48-WEEKDAY(C48,1)+5)),\"\",(C48-WEEKDAY(C48,1)+5))","v":"2020-07-02"},{"$f":"IF(MONTH(C48)<>MONTH((C48-WEEKDAY(C48,1)+6)),\"\",(C48-WEEKDAY(C48,1)+6))","v":"2020-07-03"},{"$f":"IF(MONTH(C48)<>MONTH((C48-WEEKDAY(C48,1)+7)),\"\",(C48-WEEKDAY(C48,1)+7))","v":"2020-07-04"}]
[null,null,{"$f":"SUMIFS('TRADE LOG'!$T$15:$T$9733,closeDate,\">\"&CALENDAR!C50,closeDate,\"<=\"&D50,SIZE,\">0\")","v":0},{"$f":"SUMIFS('TRADE LOG'!$T$15:$T$9733,closeDate,\">\"&CALENDAR!D50,closeDate,\"<=\"&E50,SIZE,\">0\")","v":0},{"$f":"SUMIFS('TRADE LOG'!$T$15:$T$9733,closeDate,\">\"&CALENDAR!E50,closeDate,\"<=\"&F50,SIZE,\">0\")","v":0},{"$f":"SUMIFS('TRADE LOG'!$T$15:$T$9733,closeDate,\">\"&CALENDAR!F50,closeDate,\"<=\"&G50,SIZE,\">0\")","v":0},{"$f":"SUMIFS('TRADE LOG'!$T$15:$T$9733,closeDate,\">\"&CALENDAR!G50,closeDate,\"<=\"&H50,SIZE,\">0\")","v":0},{"$f":"SUMIFS('TRADE LOG'!$T$15:$T$9733,closeDate,\">\"&CALENDAR!H50,closeDate,\"<=\"&I50,SIZE,\">0\")","v":0},{"$f":"SUMIFS('TRADE LOG'!$T$15:$T$9733,closeDate,\">\"&CALENDAR!I50,closeDate,\"<=\"&C53,SIZE,\">0\")","v":0}]
[null,null,{"$f":"COUNTIFS(closeDate,\">\"&CALENDAR!C50,closeDate,\"<=\"&D50,SIZE,\">0\")","v":0},{"$f":"COUNTIFS(closeDate,\">\"&CALENDAR!D50,closeDate,\"<=\"&E50,SIZE,\">0\")","v":0},{"$f":"COUNTIFS(closeDate,\">\"&CALENDAR!E50,closeDate,\"<=\"&F50,SIZE,\">0\")","v":0},{"$f":"COUNTIFS(closeDate,\">\"&CALENDAR!F50,closeDate,\"<=\"&G50,SIZE,\">0\")","v":0},{"$f":"COUNTIFS(closeDate,\">\"&CALENDAR!G50,closeDate,\"<=\"&H50,SIZE,\">0\")","v":0},{"$f":"COUNTIFS(closeDate,\">\"&CALENDAR!H50,closeDate,\"<=\"&I50,SIZE,\">0\")","v":0},{"$f":"COUNTIFS(closeDate,\">\"&CALENDAR!I50,closeDate,\"<=\"&(I50+1),SIZE,\">0\")","v":0}]
[null,null,{"$f":"I50+1","v":"2020-07-05"},{"$f":"C53+1","v":"2020-07-06"},{"$f":"D53+1","v":"2020-07-07"},"2020-07-08","2020-07-09","2020-07-10","2020-07-11"]
[null,null,{"$f":"SUMIFS('TRADE LOG'!$T$15:$T$9733,closeDate,\">\"&CALENDAR!C53,closeDate,\"<=\"&D53,SIZE,\">0\")","v":0},{"$f":"SUMIFS('TRADE LOG'!$T$15:$T$9733,closeDate,\">\"&CALENDAR!D53,closeDate,\"<=\"&E53,SIZE,\">0\")","v":0},{"$f":"SUMIFS('TRADE LOG'!$T$15:$T$9733,closeDate,\">\"&CALENDAR!E53,closeDate,\"<=\"&F53,SIZE,\">0\")","v":0},{"$f":"SUMIFS('TRADE LOG'!$T$15:$T$9733,closeDate,\">\"&CALENDAR!F53,closeDate,\"<=\"&G53,SIZE,\">0\")","v":0},{"$f":"SUMIFS('TRADE LOG'!$T$15:$T$9733,closeDate,\">\"&CALENDAR!G53,closeDate,\"<=\"&H53,SIZE,\">0\")","v":0},{"$f":"SUMIFS('TRADE LOG'!$T$15:$T$9733,closeDate,\">\"&CALENDAR!H53,closeDate,\"<=\"&I53,SIZE,\">0\")","v":0},{"$f":"SUMIFS('TRADE LOG'!$T$15:$T$9733,closeDate,\">\"&CALENDAR!I53,closeDate,\"<=\"&C56,SIZE,\">0\")","v":0}]
[null,null,{"$f":"COUNTIFS(closeDate,\">\"&CALENDAR!C53,closeDate,\"<=\"&D53,SIZE,\">0\")","v":0},{"$f":"COUNTIFS(closeDate,\">\"&CALENDAR!D53,closeDate,\"<=\"&E53,SIZE,\">0\")","v":0},{"$f":"COUNTIFS(closeDate,\">\"&CALENDAR!E53,closeDate,\"<=\"&F53,SIZE,\">0\")","v":0},{"$f":"COUNTIFS(closeDate,\">\"&CALENDAR!F53,closeDate,\"<=\"&G53,SIZE,\">0\")","v":0},{"$f":"COUNTIFS(closeDate,\">\"&CALENDAR!G53,closeDate,\"<=\"&H53,SIZE,\">0\")","v":0},{"$f":"COUNTIFS(closeDate,\">\"&CALENDAR!H53,closeDate,\"<=\"&I53,SIZE,\">0\")","v":0},{"$f":"COUNTIFS(closeDate,\">\"&CALENDAR!I53,closeDate,\"<=\"&(I53+1),SIZE,\">0\")","v":0}]
[null,null,{"$f":"I53+1","v":"2020-07-12"},{"$f":"C56+1","v":"2020-07-13"},{"$f":"D56+1","v":"2020-07-14"},"2020-07-15","2020-07-16","2020-07-17","2020-07-18"]
[null,null,{"$f":"SUMIFS('TRADE LOG'!$T$15:$T$9733,closeDate,\">\"&CALENDAR!C56,closeDate,\"<=\"&D56,SIZE,\">0\")","v":0},{"$f":"SUMIFS('TRADE LOG'!$T$15:$T$9733,closeDate,\">\"&CALENDAR!D56,closeDate,\"<=\"&E56,SIZE,\">0\")","v":0},{"$f":"SUMIFS('TRADE LOG'!$T$15:$T$9733,closeDate,\">\"&CALENDAR!E56,closeDate,\"<=\"&F56,SIZE,\">0\")","v":0},{"$f":"SUMIFS('TRADE LOG'!$T$15:$T$9733,closeDate,\">\"&CALENDAR!F56,closeDate,\"<=\"&G56,SIZE,\">0\")","v":0},{"$f":"SUMIFS('TRADE LOG'!$T$15:$T$9733,closeDate,\">\"&CALENDAR!G56,closeDate,\"<=\"&H56,SIZE,\">0\")","v":0},{"$f":"SUMIFS('TRADE LOG'!$T$15:$T$9733,closeDate,\">\"&CALENDAR!H56,closeDate,\"<=\"&I56,SIZE,\">0\")","v":0},{"$f":"SUMIFS('TRADE LOG'!$T$15:$T$9733,closeDate,\">\"&CALENDAR!I56,closeDate,\"<=\"&C59,SIZE,\">0\")","v":0}]
[null,null,{"$f":"COUNTIFS(closeDate,\">\"&CALENDAR!C56,closeDate,\"<=\"&D56,SIZE,\">0\")","v":0},{"$f":"COUNTIFS(closeDate,\">\"&CALENDAR!D56,closeDate,\"<=\"&E56,SIZE,\">0\")","v":0},{"$f":"COUNTIFS(closeDate,\">\"&CALENDAR!E56,closeDate,\"<=\"&F56,SIZE,\">0\")","v":0},{"$f":"COUNTIFS(closeDate,\">\"&CALENDAR!F56,closeDate,\"<=\"&G56,SIZE,\">0\")","v":0},{"$f":"COUNTIFS(closeDate,\">\"&CALENDAR!G56,closeDate,\"<=\"&H56,SIZE,\">0\")","v":0},{"$f":"COUNTIFS(closeDate,\">\"&CALENDAR!H56,closeDate,\"<=\"&I56,SIZE,\">0\")","v":0},{"$f":"COUNTIFS(closeDate,\">\"&CALENDAR!I56,closeDate,\"<=\"&(I56+1),SIZE,\">0\")","v":0}]
[null,null,{"$f":"I56+1","v":"2020-07-19"},{"$f":"C59+1","v":"2020-07-20"},{"$f":"D59+1","v":"2020-07-21"},"2020-07-22","2020-07-23","2020-07-24","2020-07-25"]
[null,null,{"$f":"SUMIFS('TRADE LOG'!$T$15:$T$9733,closeDate,\">\"&CALENDAR!C59,closeDate,\"<=\"&D59,SIZE,\">0\")","v":0},{"$f":"SUMIFS('TRADE LOG'!$T$15:$T$9733,closeDate,\">\"&CALENDAR!D59,closeDate,\"<=\"&E59,SIZE,\">0\")","v":0},{"$f":"SUMIFS('TRADE LOG'!$T$15:$T$9733,closeDate,\">\"&CALENDAR!E59,closeDate,\"<=\"&F59,SIZE,\">0\")","v":0},{"$f":"SUMIFS('TRADE LOG'!$T$15:$T$9733,closeDate,\">\"&CALENDAR!F59,closeDate,\"<=\"&G59,SIZE,\">0\")","v":0},{"$f":"SUMIFS('TRADE LOG'!$T$15:$T$9733,closeDate,\">\"&CALENDAR!G59,closeDate,\"<=\"&H59,SIZE,\">0\")","v":0},{"$f":"SUMIFS('TRADE LOG'!$T$15:$T$9733,closeDate,\">\"&CALENDAR!H59,closeDate,\"<=\"&I59,SIZE,\">0\")","v":0},{"$f":"SUMIFS('TRADE LOG'!$T$15:$T$9733,closeDate,\">\"&CALENDAR!I59,closeDate,\"<=\"&C62,SIZE,\">0\")","v":0}]
[null,null,{"$f":"COUNTIFS(closeDate,\">\"&CALENDAR!C59,closeDate,\"<=\"&D59,SIZE,\">0\")","v":0},{"$f":"COUNTIFS(closeDate,\">\"&CALENDAR!D59,closeDate,\"<=\"&E59,SIZE,\">0\")","v":0},{"$f":"COUNTIFS(closeDate,\">\"&CALENDAR!E59,closeDate,\"<=\"&F59,SIZE,\">0\")","v":0},{"$f":"COUNTIFS(closeDate,\">\"&CALENDAR!F59,closeDate,\"<=\"&G59,SIZE,\">0\")","v":0},{"$f":"COUNTIFS(closeDate,\">\"&CALENDAR!G59,closeDate,\"<=\"&H59,SIZE,\">0\")","v":0},{"$f":"COUNTIFS(closeDate,\">\"&CALENDAR!H59,closeDate,\"<=\"&I59,SIZE,\">0\")","v":0},{"$f":"COUNTIFS(closeDate,\">\"&CALENDAR!I59,closeDate,\"<=\"&(I59+1),SIZE,\">0\")","v":0}]
[null,null,{"$f":"IFERROR(IF(MONTH(C48)<>MONTH(I59+1),\"\",(I59+1)),\"\")","v":"2020-07-26"},{"$f":"IFERROR(IF(MONTH(C48)<>MONTH(C62+1),\"\",(C62+1)),\"\")","v":"2020-07-27"},{"$f":"IFERROR(IF(MONTH(C48)<>MONTH(D62+1),\"\",(D62+1)),\"\")","v":"2020-07-28"},{"$f":"IFERROR(IF(MONTH(C48)<>MONTH(E62+1),\"\",(E62+1)),\"\")","v":"2020-07-29"},{"$f":"IFERROR(IF(MONTH(C48)<>MONTH(F62+1),\"\",(F62+1)),\"\")","v":"2020-07-30"},{"$f":"IFERROR(IF(MONTH(C48)<>MONTH(G62+1),\"\",(G62+1)),\"\")","v":"2020-07-31"},{"$f":"IFERROR(IF(MONTH(C48)<>MONTH(H62+1),\"\",(H62+1)),\"\")","v":""}]
[null,null,{"$f":"SUMIFS('TRADE LOG'!$T$15:$T$9733,closeDate,\">\"&CALENDAR!C62,closeDate,\"<=\"&D62,SIZE,\">0\")","v":0},{"$f":"SUMIFS('TRADE LOG'!$T$15:$T$9733,closeDate,\">\"&CALENDAR!D62,closeDate,\"<=\"&E62,SIZE,\">0\")","v":0},{"$f":"SUMIFS('TRADE LOG'!$T$15:$T$9733,closeDate,\">\"&CALENDAR!E62,closeDate,\"<=\"&F62,SIZE,\">0\")","v":0},{"$f":"SUMIFS('TRADE LOG'!$T$15:$T$9733,closeDate,\">\"&CALENDAR!F62,closeDate,\"<=\"&G62,SIZE,\">0\")","v":0},{"$f":"SUMIFS('TRADE LOG'!$T$15:$T$9733,closeDate,\">\"&CALENDAR!G62,closeDate,\"<=\"&H62,SIZE,\">0\")","v":0},{"$f":"SUMIFS('TRADE LOG'!$T$15:$T$9733,closeDate,\">\"&CALENDAR!H62,closeDate,\"<=\"&I62,SIZE,\">0\")","v":0},{"$f":"SUMIFS('TRADE LOG'!$T$15:$T$9733,closeDate,\">\"&CALENDAR!I62,closeDate,\"<=\"&C65,SIZE,\">0\")","v":0}]
[null,null,{"$f":"COUNTIFS(closeDate,\">\"&CALENDAR!C62,closeDate,\"<=\"&D62,SIZE,\">0\")","v":0},{"$f":"COUNTIFS(closeDate,\">\"&CALENDAR!D62,closeDate,\"<=\"&E62,SIZE,\">0\")","v":0},{"$f":"COUNTIFS(closeDate,\">\"&CALENDAR!E62,closeDate,\"<=\"&F62,SIZE,\">0\")","v":0},{"$f":"COUNTIFS(closeDate,\">\"&CALENDAR!F62,closeDate,\"<=\"&G62,SIZE,\">0\")","v":0},{"$f":"COUNTIFS(closeDate,\">\"&CALENDAR!G62,closeDate,\"<=\"&H62,SIZE,\">0\")","v":0},{"$f":"COUNTIFS(closeDate,\">\"&CALENDAR!H62,closeDate,\"<=\"&I62,SIZE,\">0\")","v":0},{"$f":"COUNTIFS(closeDate,\">\"&CALENDAR!I62,closeDate,\"<=\"&(I62+1),SIZE,\">0\")","v":0}]
[null,null,{"$f":"IFERROR(IF(MONTH(C48)<>MONTH(I62+1),\"\",(I62+1)),\"\")","v":""},{"$f":"IFERROR(IF(MONTH(C48)<>MONTH(C65+1),\"\",(C65+1)),\"\")","v":""},{"$f":"IFERROR(IF(MONTH(C48)<>MONTH(D65+1),\"\",(D65+1)),\"\")","v":""},{"$f":"IFERROR(IF(MONTH(C48)<>MONTH(E65+1),\"\",(E65+1)),\"\")","v":""},{"$f":"IFERROR(IF(MONTH(C48)<>MONTH(F65+1),\"\",(F65+1)),\"\")","v":""},{"$f":"IFERROR(IF(MONTH(C48)<>MONTH(G65+1),\"\",(G65+1)),\"\")","v":""},{"$f":"IFERROR(IF(MONTH(C48)<>MONTH(H65+1),\"\",(H65+1)),\"\")","v":""}]
[null,null,{"$f":"SUMIFS('TRADE LOG'!$T$15:$T$9733,closeDate,\">\"&CALENDAR!C65,closeDate,\"<=\"&D65,SIZE,\">0\")","v":0},{"$f":"SUMIFS('TRADE LOG'!$T$15:$T$9733,closeDate,\">\"&CALENDAR!D65,closeDate,\"<=\"&E65,SIZE,\">0\")","v":0},{"$f":"SUMIFS('TRADE LOG'!$T$15:$T$9733,closeDate,\">\"&CALENDAR!E65,closeDate,\"<=\"&F65,SIZE,\">0\")","v":0},{"$f":"SUMIFS('TRADE LOG'!$T$15:$T$9733,closeDate,\">\"&CALENDAR!F65,closeDate,\"<=\"&G65,SIZE,\">0\")","v":0},{"$f":"SUMIFS('TRADE LOG'!$T$15:$T$9733,closeDate,\">\"&CALENDAR!G65,closeDate,\"<=\"&H65,SIZE,\">0\")","v":0},{"$f":"SUMIFS('TRADE LOG'!$T$15:$T$9733,closeDate,\">\"&CALENDAR!H65,closeDate,\"<=\"&I65,SIZE,\">0\")","v":0},{"$f":"SUMIFS('TRADE LOG'!$T$15:$T$9733,closeDate,\">\"&CALENDAR!I65,closeDate,\"<=\"&C68,SIZE,\">0\")","v":0}]
[null,null,{"$f":"COUNTIFS(closeDate,\">\"&CALENDAR!C65,closeDate,\"<=\"&D65,SIZE,\">0\")","v":0},{"$f":"COUNTIFS(closeDate,\">\"&CALENDAR!D65,closeDate,\"<=\"&E65,SIZE,\">0\")","v":0},{"$f":"COUNTIFS(closeDate,\">\"&CALENDAR!E65,closeDate,\"<=\"&F65,SIZE,\">0\")","v":0},{"$f":"COUNTIFS(closeDate,\">\"&CALENDAR!F65,closeDate,\"<=\"&G65,SIZE,\">0\")","v":0},{"$f":"COUNTIFS(closeDate,\">\"&CALENDAR!G65,closeDate,\"<=\"&H65,SIZE,\">0\")","v":0},{"$f":"COUNTIFS(closeDate,\">\"&CALENDAR!H65,closeDate,\"<=\"&I65,SIZE,\">0\")","v":0},{"$f":"COUNTIFS(closeDate,\">\"&CALENDAR!I65,closeDate,\"<=\"&(I65+1),SIZE,\">0\")","v":0}]
[]
[null,null,{"$f":"EOMONTH(C48,0)+1","v":"2020-08-01"}]
[null,null,"SUN","MON","TUE","WED","THU","FRI","SAT"]
[null,null,{"$f":"IF(MONTH(C69)<>MONTH((C69-WEEKDAY(C69,1)+1)),\"\",(C69-WEEKDAY(C69,1)+1))","v":""},{"$f":"IF(MONTH(C69)<>MONTH((C69-WEEKDAY(C69,1)+2)),\"\",(C69-WEEKDAY(C69,1)+2))","v":""},{"$f":"IF(MONTH(C69)<>MONTH((C69-WEEKDAY(C69,1)+3)),\"\",(C69-WEEKDAY(C69,1)+3))","v":""},{"$f":"IF(MONTH(C69)<>MONTH((C69-WEEKDAY(C69,1)+4)),\"\",(C69-WEEKDAY(C69,1)+4))","v":""},{"$f":"IF(MONTH(C69)<>MONTH((C69-WEEKDAY(C69,1)+5)),\"\",(C69-WEEKDAY(C69,1)+5))","v":""},{"$f":"IF(MONTH(C69)<>MONTH((C69-WEEKDAY(C69,1)+6)),\"\",(C69-WEEKDAY(C69,1)+6))","v":""},{"$f":"IF(MONTH(C69)<>MONTH((C69-WEEKDAY(C69,1)+7)),\"\",(C69-WEEKDAY(C69,1)+7))","v":"2020-08-01"}]
[null,null,{"$f":"SUMIFS('TRADE LOG'!$T$15:$T$9733,closeDate,\">\"&CALENDAR!C71,closeDate,\"<=\"&D71,SIZE,\">0\")","v":0},{"$f":"SUMIFS('TRADE LOG'!$T$15:$T$9733,closeDate,\">\"&CALENDAR!D71,closeDate,\"<=\"&E71,SIZE,\">0\")","v":0},{"$f":"SUMIFS('TRADE LOG'!$T$15:$T$9733,closeDate,\">\"&CALENDAR!E71,closeDate,\"<=\"&F71,SIZE,\">0\")","v":0},{"$f":"SUMIFS('TRADE LOG'!$T$15:$T$9733,closeDate,\">\"&CALENDAR!F71,closeDate,\"<=\"&G71,SIZE,\">0\")","v":0},{"$f":"SUMIFS('TRADE LOG'!$T$15:$T$9733,closeDate,\">\"&CALENDAR!G71,closeDate,\"<=\"&H71,SIZE,\">0\")","v":0},{"$f":"SUMIFS('TRADE LOG'!$T$15:$T$9733,closeDate,\">\"&CALENDAR!H71,closeDate,\"<=\"&I71,SIZE,\">0\")","v":0},{"$f":"SUMIFS('TRADE LOG'!$T$15:$T$9733,closeDate,\">\"&CALENDAR!I71,closeDate,\"<=\"&C74,SIZE,\">0\")","v":0}]
[null,null,{"$f":"COUNTIFS(closeDate,\">\"&CALENDAR!C71,closeDate,\"<=\"&D71,SIZE,\">0\")","v":0},{"$f":"COUNTIFS(closeDate,\">\"&CALENDAR!D71,closeDate,\"<=\"&E71,SIZE,\">0\")","v":0},{"$f":"COUNTIFS(closeDate,\">\"&CALENDAR!E71,closeDate,\"<=\"&F71,SIZE,\">0\")","v":0},{"$f":"COUNTIFS(closeDate,\">\"&CALENDAR!F71,closeDate,\"<=\"&G71,SIZE,\">0\")","v":0},{"$f":"COUNTIFS(closeDate,\">\"&CALENDAR!G71,closeDate,\"<=\"&H71,SIZE,\">0\")","v":0},{"$f":"COUNTIFS(closeDate,\">\"&CALENDAR!H71,closeDate,\"<=\"&I71,SIZE,\">0\")","v":0},{"$f":"COUNTIFS(closeDate,\">\"&CALENDAR!I71,closeDate,\"<=\"&(I71+1),SIZE,\">0\")","v":0}]
[null,null,{"$f":"I71+1","v":"2020-08-02"},{"$f":"C74+1","v":"2020-08-03"},{"$f":"D74+1","v":"2020-08-04"},"2020-08-05","2020-08-06","2020-08-07","2020-08-08"]
[null,null,{"$f":"SUMIFS('TRADE LOG'!$T$15:$T$9733,closeDate,\">\"&CALENDAR!C74,closeDate,\"<=\"&D74,SIZE,\">0\")","v":0},{"$f":"SUMIFS('TRADE LOG'!$T$15:$T$9733,closeDate,\">\"&CALENDAR!D74,closeDate,\"<=\"&E74,SIZE,\">0\")","v":0},{"$f":"SUMIFS('TRADE LOG'!$T$15:$T$9733,closeDate,\">\"&CALENDAR!E74,closeDate,\"<=\"&F74,SIZE,\">0\")","v":0},{"$f":"SUMIFS('TRADE LOG'!$T$15:$T$9733,closeDate,\">\"&CALENDAR!F74,closeDate,\"<=\"&G74,SIZE,\">0\")","v":0},{"$f":"SUMIFS('TRADE LOG'!$T$15:$T$9733,closeDate,\">\"&CALENDAR!G74,closeDate,\"<=\"&H74,SIZE,\">0\")","v":0},{"$f":"SUMIFS('TRADE LOG'!$T$15:$T$9733,closeDate,\">\"&CALENDAR!H74,closeDate,\"<=\"&I74,SIZE,\">0\")","v":0},{"$f":"SUMIFS('TRADE LOG'!$T$15:$T$9733,closeDate,\">\"&CALENDAR!I74,closeDate,\"<=\"&C77,SIZE,\">0\")","v":0}]
[null,null,{"$f":"COUNTIFS(closeDate,\">\"&CALENDAR!C74,closeDate,\"<=\"&D74,SIZE,\">0\")","v":0},{"$f":"COUNTIFS(closeDate,\">\"&CALENDAR!D74,closeDate,\"<=\"&E74,SIZE,\">0\")","v":0},{"$f":"COUNTIFS(closeDate,\">\"&CALENDAR!E74,closeDate,\"<=\"&F74,SIZE,\">0\")","v":0},{"$f":"COUNTIFS(closeDate,\">\"&CALENDAR!F74,closeDate,\"<=\"&G74,SIZE,\">0\")","v":0},{"$f":"COUNTIFS(closeDate,\">\"&CALENDAR!G74,closeDate,\"<=\"&H74,SIZE,\">0\")","v":0},{"$f":"COUNTIFS(closeDate,\">\"&CALENDAR!H74,closeDate,\"<=\"&I74,SIZE,\">0\")","v":0},{"$f":"COUNTIFS(closeDate,\">\"&CALENDAR!I74,closeDate,\"<=\"&(I74+1),SIZE,\">0\")","v":0}]
[null,null,{"$f":"I74+1","v":"2020-08-09"},{"$f":"C77+1","v":"2020-08-10"},{"$f":"D77+1","v":"2020-08-11"},"2020-08-12","2020-08-13","2020-08-14","2020-08-15"]
[null,null,{"$f":"SUMIFS('TRADE LOG'!$T$15:$T$9733,closeDate,\">\"&CALENDAR!C77,closeDate,\"<=\"&D77,SIZE,\">0\")","v":0},{"$f":"SUMIFS('TRADE LOG'!$T$15:$T$9733,closeDate,\">\"&CALENDAR!D77,closeDate,\"<=\"&E77,SIZE,\">0\")","v":0},{"$f":"SUMIFS('TRADE LOG'!$T$15:$T$9733,closeDate,\">\"&CALENDAR!E77,closeDate,\"<=\"&F77,SIZE,\">0\")","v":0},{"$f":"SUMIFS('TRADE LOG'!$T$15:$T$9733,closeDate,\">\"&CALENDAR!F77,closeDate,\"<=\"&G77,SIZE,\">0\")","v":0},{"$f":"SUMIFS('TRADE LOG'!$T$15:$T$9733,closeDate,\">\"&CALENDAR!G77,closeDate,\"<=\"&H77,SIZE,\">0\")","v":0},{"$f":"SUMIFS('TRADE LOG'!$T$15:$T$9733,closeDate,\">\"&CALENDAR!H77,closeDate,\"<=\"&I77,SIZE,\">0\")","v":0},{"$f":"SUMIFS('TRADE LOG'!$T$15:$T$9733,closeDate,\">\"&CALENDAR!I77,closeDate,\"<=\"&C80,SIZE,\">0\")","v":0}]
[null,null,{"$f":"COUNTIFS(closeDate,\">\"&CALENDAR!C77,closeDate,\"<=\"&D77,SIZE,\">0\")","v":0},{"$f":"COUNTIFS(closeDate,\">\"&CALENDAR!D77,closeDate,\"<=\"&E77,SIZE,\">0\")","v":0},{"$f":"COUNTIFS(closeDate,\">\"&CALENDAR!E77,closeDate,\"<=\"&F77,SIZE,\">0\")","v":0},{"$f":"COUNTIFS(closeDate,\">\"&CALENDAR!F77,closeDate,\"<=\"&G77,SIZE,\">0\")","v":0},{"$f":"COUNTIFS(closeDate,\">\"&CALENDAR!G77,closeDate,\"<=\"&H77,SIZE,\">0\")","v":0},{"$f":"COUNTIFS(closeDate,\">\"&CALENDAR!H77,closeDate,\"<=\"&I77,SIZE,\">0\")","v":0},{"$f":"COUNTIFS(closeDate,\">\"&CALENDAR!I77,closeDate,\"<=\"&(I77+1),SIZE,\">0\")","v":0}]
[null,null,{"$f":"I77+1","v":"2020-08-16"},{"$f":"C80+1","v":"2020-08-17"},{"$f":"D80+1","v":"2020-08-18"},"2020-08-19","2020-08-20","2020-08-21","2020-08-22"]
[null,null,{"$f":"SUMIFS('TRADE LOG'!$T$15:$T$9733,closeDate,\">\"&CALENDAR!C80,closeDate,\"<=\"&D80,SIZE,\">0\")","v":0},{"$f":"SUMIFS('TRADE LOG'!$T$15:$T$9733,closeDate,\">\"&CALENDAR!D80,closeDate,\"<=\"&E80,SIZE,\">0\")","v":0},{"$f":"SUMIFS('TRADE LOG'!$T$15:$T$9733,closeDate,\">\"&CALENDAR!E80,closeDate,\"<=\"&F80,SIZE,\">0\")","v":0},{"$f":"SUMIFS('TRADE LOG'!$T$15:$T$9733,closeDate,\">\"&CALENDAR!F80,closeDate,\"<=\"&G80,SIZE,\">0\")","v":0},{"$f":"SUMIFS('TRADE LOG'!$T$15:$T$9733,closeDate,\">\"&CALENDAR!G80,closeDate,\"<=\"&H80,SIZE,\">0\")","v":0},{"$f":"SUMIFS('TRADE LOG'!$T$15:$T$9733,closeDate,\">\"&CALENDAR!H80,closeDate,\"<=\"&I80,SIZE,\">0\")","v":0},{"$f":"SUMIFS('TRADE LOG'!$T$15:$T$9733,closeDate,\">\"&CALENDAR!I80,closeDate,\"<=\"&C83,SIZE,\">0\")","v":0}]
[null,null,{"$f":"COUNTIFS(closeDate,\">\"&CALENDAR!C80,closeDate,\"<=\"&D80,SIZE,\">0\")","v":0},{"$f":"COUNTIFS(closeDate,\">\"&CALENDAR!D80,closeDate,\"<=\"&E80,SIZE,\">0\")","v":0},{"$f":"COUNTIFS(closeDate,\">\"&CALENDAR!E80,closeDate,\"<=\"&F80,SIZE,\">0\")","v":0},{"$f":"COUNTIFS(closeDate,\">\"&CALENDAR!F80,closeDate,\"<=\"&G80,SIZE,\">0\")","v":0},{"$f":"COUNTIFS(closeDate,\">\"&CALENDAR!G80,closeDate,\"<=\"&H80,SIZE,\">0\")","v":0},{"$f":"COUNTIFS(closeDate,\">\"&CALENDAR!H80,closeDate,\"<=\"&I80,SIZE,\">0\")","v":0},{"$f":"COUNTIFS(closeDate,\">\"&CALENDAR!I80,closeDate,\"<=\"&(I80+1),SIZE,\">0\")","v":0}]
[null,null,{"$f":"IFERROR(IF(MONTH(C69)<>MONTH(I80+1),\"\",(I80+1)),\"\")","v":"2020-08-23"},{"$f":"IFERROR(IF(MONTH(C69)<>MONTH(C83+1),\"\",(C83+1)),\"\")","v":"2020-08-24"},{"$f":"IFERROR(IF(MONTH(C69)<>MONTH(D83+1),\"\",(D83+1)),\"\")","v":"2020-08-25"},{"$f":"IFERROR(IF(MONTH(C69)<>MONTH(E83+1),\"\",(E83+1)),\"\")","v":"2020-08-26"},{"$f":"IFERROR(IF(MONTH(C69)<>MONTH(F83+1),\"\",(F83+1)),\"\")","v":"2020-08-27"},{"$f":"IFERROR(IF(MONTH(C69)<>MONTH(G83+1),\"\",(G83+1)),\"\")","v":"2020-08-28"},{"$f":"IFERROR(IF(MONTH(C69)<>MONTH(H83+1),\"\",(H83+1)),\"\")","v":"2020-08-29"}]
[null,null,{"$f":"SUMIFS('TRADE LOG'!$T$15:$T$9733,closeDate,\">\"&CALENDAR!C83,closeDate,\"<=\"&D83,SIZE,\">0\")","v":0},{"$f":"SUMIFS('TRADE LOG'!$T$15:$T$9733,closeDate,\">\"&CALENDAR!D83,closeDate,\"<=\"&E83,SIZE,\">0\")","v":0},{"$f":"SUMIFS('TRADE LOG'!$T$15:$T$9733,closeDate,\">\"&CALENDAR!E83,closeDate,\"<=\"&F83,SIZE,\">0\")","v":0},{"$f":"SUMIFS('TRADE LOG'!$T$15:$T$9733,closeDate,\">\"&CALENDAR!F83,closeDate,\"<=\"&G83,SIZE,\">0\")","v":0},{"$f":"SUMIFS('TRADE LOG'!$T$15:$T$9733,closeDate,\">\"&CALENDAR!G83,closeDate,\"<=\"&H83,SIZE,\">0\")","v":0},{"$f":"SUMIFS('TRADE LOG'!$T$15:$T$9733,closeDate,\">\"&CALENDAR!H83,closeDate,\"<=\"&I83,SIZE,\">0\")","v":0},{"$f":"SUMIFS('TRADE LOG'!$T$15:$T$9733,closeDate,\">\"&CALENDAR!I83,closeDate,\"<=\"&C86,SIZE,\">0\")","v":0}]
[null,null,{"$f":"COUNTIFS(closeDate,\">\"&CALENDAR!C83,closeDate,\"<=\"&D83,SIZE,\">0\")","v":0},{"$f":"COUNTIFS(closeDate,\">\"&CALENDAR!D83,closeDate,\"<=\"&E83,SIZE,\">0\")","v":0},{"$f":"COUNTIFS(closeDate,\">\"&CALENDAR!E83,closeDate,\"<=\"&F83,SIZE,\">0\")","v":0},{"$f":"COUNTIFS(closeDate,\">\"&CALENDAR!F83,closeDate,\"<=\"&G83,SIZE,\">0\")","v":0},{"$f":"COUNTIFS(closeDate,\">\"&CALENDAR!G83,closeDate,\"<=\"&H83,SIZE,\">0\")","v":0},{"$f":"COUNTIFS(closeDate,\">\"&CALENDAR!H83,closeDate,\"<=\"&I83,SIZE,\">0\")","v":0},{"$f":"COUNTIFS(closeDate,\">\"&CALENDAR!I83,closeDate,\"<=\"&(I83+1),SIZE,\">0\")","v":0}]
[null,null,{"$f":"IFERROR(IF(MONTH(C69)<>MONTH(I83+1),\"\",(I83+1)),\"\")","v":"2020-08-30"},{"$f":"IFERROR(IF(MONTH(C69)<>MONTH(C86+1),\"\",(C86+1)),\"\")","v":"2020-08-31"},{"$f":"IFERROR(IF(MONTH(C69)<>MONTH(D86+1),\"\",(D86+1)),\"\")","v":""},{"$f":"IFERROR(IF(MONTH(C69)<>MONTH(E86+1),\"\",(E86+1)),\"\")","v":""},{"$f":"IFERROR(IF(MONTH(C69)<>MONTH(F86+1),\"\",(F86+1)),\"\")","v":""},{"$f":"IFERROR(IF(MONTH(C69)<>MONTH(G86+1),\"\",(G86+1)),\"\")","v":""},{"$f":"IFERROR(IF(MONTH(C69)<>MONTH(H86+1),\"\",(H86+1)),\"\")","v":""}]
[null,null,{"$f":"SUMIFS('TRADE LOG'!$T$15:$T$9733,closeDate,\">\"&CALENDAR!C86,closeDate,\"<=\"&D86,SIZE,\">0\")","v":0},{"$f":"SUMIFS('TRADE LOG'!$T$15:$T$9733,closeDate,\">\"&CALENDAR!D86,closeDate,\"<=\"&E86,SIZE,\">0\")","v":0},{"$f":"SUMIFS('TRADE LOG'!$T$15:$T$9733,closeDate,\">\"&CALENDAR!E86,closeDate,\"<=\"&F86,SIZE,\">0\")","v":0},{"$f":"SUMIFS('TRADE LOG'!$T$15:$T$9733,closeDate,\">\"&CALENDAR!F86,closeDate,\"<=\"&G86,SIZE,\">0\")","v":0},{"$f":"SUMIFS('TRADE LOG'!$T$15:$T$9733,closeDate,\">\"&CALENDAR!G86,closeDate,\"<=\"&H86,SIZE,\">0\")","v":0},{"$f":"SUMIFS('TRADE LOG'!$T$15:$T$9733,closeDate,\">\"&CALENDAR!H86,closeDate,\"<=\"&I86,SIZE,\">0\")","v":0},{"$f":"SUMIFS('TRADE LOG'!$T$15:$T$9733,closeDate,\">\"&CALENDAR!I86,closeDate,\"<=\"&C89,SIZE,\">0\")","v":0}]
[null,null,{"$f":"COUNTIFS(closeDate,\">\"&CALENDAR!C86,closeDate,\"<=\"&D86,SIZE,\">0\")","v":0},{"$f":"COUNTIFS(closeDate,\">\"&CALENDAR!D86,closeDate,\"<=\"&E86,SIZE,\">0\")","v":0},{"$f":"COUNTIFS(closeDate,\">\"&CALENDAR!E86,closeDate,\"<=\"&F86,SIZE,\">0\")","v":0},{"$f":"COUNTIFS(closeDate,\">\"&CALENDAR!F86,closeDate,\"<=\"&G86,SIZE,\">0\")","v":0},{"$f":"COUNTIFS(closeDate,\">\"&CALENDAR!G86,closeDate,\"<=\"&H86,SIZE,\">0\")","v":0},{"$f":"COUNTIFS(closeDate,\">\"&CALENDAR!H86,closeDate,\"<=\"&I86,SIZE,\">0\")","v":0},{"$f":"COUNTIFS(closeDate,\">\"&CALENDAR!I86,closeDate,\"<=\"&(I86+1),SIZE,\">0\")","v":0}]
[]
[null,null,{"$f":"EOMONTH(C69,0)+1","v":"2020-09-01"}]
[null,null,"SUN","MON","TUE","WED","THU","FRI","SAT"]
[null,null,{"$f":"IF(MONTH(C90)<>MONTH((C90-WEEKDAY(C90,1)+1)),\"\",(C90-WEEKDAY(C90,1)+1))","v":""},{"$f":"IF(MONTH(C90)<>MONTH((C90-WEEKDAY(C90,1)+2)),\"\",(C90-WEEKDAY(C90,1)+2))","v":""},{"$f":"IF(MONTH(C90)<>MONTH((C90-WEEKDAY(C90,1)+3)),\"\",(C90-WEEKDAY(C90,1)+3))","v":"2020-09-01"},{"$f":"IF(MONTH(C90)<>MONTH((C90-WEEKDAY(C90,1)+4)),\"\",(C90-WEEKDAY(C90,1)+4))","v":"2020-09-02"},{"$f":"IF(MONTH(C90)<>MONTH((C90-WEEKDAY(C90,1)+5)),\"\",(C90-WEEKDAY(C90,1)+5))","v":"2020-09-03"},{"$f":"IF(MONTH(C90)<>MONTH((C90-WEEKDAY(C90,1)+6)),\"\",(C90-WEEKDAY(C90,1)+6))","v":"2020-09-04"},{"$f":"IF(MONTH(C90)<>MONTH((C90-WEEKDAY(C90,1)+7)),\"\",(C90-WEEKDAY(C90,1)+7))","v":"2020-09-05"}]
[null,null,{"$f":"SUMIFS('TRADE LOG'!$T$15:$T$9733,closeDate,\">\"&CALENDAR!C92,closeDate,\"<=\"&D92,SIZE,\">0\")","v":0},{"$f":"SUMIFS('TRADE LOG'!$T$15:$T$9733,closeDate,\">\"&CALENDAR!D92,closeDate,\"<=\"&E92,SIZE,\">0\")","v":0},{"$f":"SUMIFS('TRADE LOG'!$T$15:$T$9733,closeDate,\">\"&CALENDAR!E92,closeDate,\"<=\"&F92,SIZE,\">0\")","v":0},{"$f":"SUMIFS('TRADE LOG'!$T$15:$T$9733,closeDate,\">\"&CALENDAR!F92,closeDate,\"<=\"&G92,SIZE,\">0\")","v":0},{"$f":"SUMIFS('TRADE LOG'!$T$15:$T$9733,closeDate,\">\"&CALENDAR!G92,closeDate,\"<=\"&H92,SIZE,\">0\")","v":0},{"$f":"SUMIFS('TRADE LOG'!$T$15:$T$9733,closeDate,\">\"&CALENDAR!H92,closeDate,\"<=\"&I92,SIZE,\">0\")","v":0},{"$f":"SUMIFS('TRADE LOG'!$T$15:$T$9733,closeDate,\">\"&CALENDAR!I92,closeDate,\"<=\"&C95,SIZE,\">0\")","v":0}]
[null,null,{"$f":"COUNTIFS(closeDate,\">\"&CALENDAR!C92,closeDate,\"<=\"&D92,SIZE,\">0\")","v":0},{"$f":"COUNTIFS(closeDate,\">\"&CALENDAR!D92,closeDate,\"<=\"&E92,SIZE,\">0\")","v":0},{"$f":"COUNTIFS(closeDate,\">\"&CALENDAR!E92,closeDate,\"<=\"&F92,SIZE,\">0\")","v":0},{"$f":"COUNTIFS(closeDate,\">\"&CALENDAR!F92,closeDate,\"<=\"&G92,SIZE,\">0\")","v":0},{"$f":"COUNTIFS(closeDate,\">\"&CALENDAR!G92,closeDate,\"<=\"&H92,SIZE,\">0\")","v":0},{"$f":"COUNTIFS(closeDate,\">\"&CALENDAR!H92,closeDate,\"<=\"&I92,SIZE,\">0\")","v":0},{"$f":"COUNTIFS(closeDate,\">\"&CALENDAR!I92,closeDate,\"<=\"&(I92+1),SIZE,\">0\")","v":0}]
[null,null,{"$f":"I92+1","v":"2020-09-06"},{"$f":"C95+1","v":"2020-09-07"},{"$f":"D95+1","v":"2020-09-08"},"2020-09-09","2020-09-10","2020-09-11","2020-09-12"]
[null,null,{"$f":"SUMIFS('TRADE LOG'!$T$15:$T$9733,closeDate,\">\"&CALENDAR!C95,closeDate,\"<=\"&D95,SIZE,\">0\")","v":0},{"$f":"SUMIFS('TRADE LOG'!$T$15:$T$9733,closeDate,\">\"&CALENDAR!D95,closeDate,\"<=\"&E95,SIZE,\">0\")","v":0},{"$f":"SUMIFS('TRADE LOG'!$T$15:$T$9733,closeDate,\">\"&CALENDAR!E95,closeDate,\"<=\"&F95,SIZE,\">0\")","v":0},{"$f":"SUMIFS('TRADE LOG'!$T$15:$T$9733,closeDate,\">\"&CALENDAR!F95,closeDate,\"<=\"&G95,SIZE,\">0\")","v":0},{"$f":"SUMIFS('TRADE LOG'!$T$15:$T$9733,closeDate,\">\"&CALENDAR!G95,closeDate,\"<=\"&H95,SIZE,\">0\")","v":0},{"$f":"SUMIFS('TRADE LOG'!$T$15:$T$9733,closeDate,\">\"&CALENDAR!H95,closeDate,\"<=\"&I95,SIZE,\">0\")","v":0},{"$f":"SUMIFS('TRADE LOG'!$T$15:$T$9733,closeDate,\">\"&CALENDAR!I95,closeDate,\"<=\"&C98,SIZE,\">0\")","v":0}]
[null,null,{"$f":"COUNTIFS(closeDate,\">\"&CALENDAR!C95,closeDate,\"<=\"&D95,SIZE,\">0\")","v":0},{"$f":"COUNTIFS(closeDate,\">\"&CALENDAR!D95,closeDate,\"<=\"&E95,SIZE,\">0\")","v":0},{"$f":"COUNTIFS(closeDate,\">\"&CALENDAR!E95,closeDate,\"<=\"&F95,SIZE,\">0\")","v":0},{"$f":"COUNTIFS(closeDate,\">\"&CALENDAR!F95,closeDate,\"<=\"&G95,SIZE,\">0\")","v":0},{"$f":"COUNTIFS(closeDate,\">\"&CALENDAR!G95,closeDate,\"<=\"&H95,SIZE,\">0\")","v":0},{"$f":"COUNTIFS(closeDate,\">\"&CALENDAR!H95,closeDate,\"<=\"&I95,SIZE,\">0\")","v":0},{"$f":"COUNTIFS(closeDate,\">\"&CALENDAR!I95,closeDate,\"<=\"&(I95+1),SIZE,\">0\")","v":0}]
[null,null,{"$f":"I95+1","v":"2020-09-13"},{"$f":"C98+1","v":"2020-09-14"},{"$f":"D98+1","v":"2020-09-15"},"2020-09-16","2020-09-17","2020-09-18","2020-09-19"]
[null,null,{"$f":"SUMIFS('TRADE LOG'!$T$15:$T$9733,closeDate,\">\"&CALENDAR!C98,closeDate,\"<=\"&D98,SIZE,\">0\")","v":0},{"$f":"SUMIFS('TRADE LOG'!$T$15:$T$9733,closeDate,\">\"&CALENDAR!D98,closeDate,\"<=\"&E98,SIZE,\">0\")","v":0},{"$f":"SUMIFS('TRADE LOG'!$T$15:$T$9733,closeDate,\">\"&CALENDAR!E98,closeDate,\"<=\"&F98,SIZE,\">0\")","v":0},{"$f":"SUMIFS('TRADE LOG'!$T$15:$T$9733,closeDate,\">\"&CALENDAR!F98,closeDate,\"<=\"&G98,SIZE,\">0\")","v":0},{"$f":"SUMIFS('TRADE LOG'!$T$15:$T$9733,closeDate,\">\"&CALENDAR!G98,closeDate,\"<=\"&H98,SIZE,\">0\")","v":0},{"$f":"SUMIFS('TRADE LOG'!$T$15:$T$9733,closeDate,\">\"&CALENDAR!H98,closeDate,\"<=\"&I98,SIZE,\">0\")","v":0},{"$f":"SUMIFS('TRADE LOG'!$T$15:$T$9733,closeDate,\">\"&CALENDAR!I98,closeDate,\"<=\"&C101,SIZE,\">0\")","v":0}]
[null,null,{"$f":"COUNTIFS(closeDate,\">\"&CALENDAR!C98,closeDate,\"<=\"&D98,SIZE,\">0\")","v":0},{"$f":"COUNTIFS(closeDate,\">\"&CALENDAR!D98,closeDate,\"<=\"&E98,SIZE,\">0\")","v":0},{"$f":"COUNTIFS(closeDate,\">\"&CALENDAR!E98,closeDate,\"<=\"&F98,SIZE,\">0\")","v":0},{"$f":"COUNTIFS(closeDate,\">\"&CALENDAR!F98,closeDate,\"<=\"&G98,SIZE,\">0\")","v":0},{"$f":"COUNTIFS(closeDate,\">\"&CALENDAR!G98,closeDate,\"<=\"&H98,SIZE,\">0\")","v":0},{"$f":"COUNTIFS(closeDate,\">\"&CALENDAR!H98,closeDate,\"<=\"&I98,SIZE,\">0\")","v":0},{"$f":"COUNTIFS(closeDate,\">\"&CALENDAR!I98,closeDate,\"<=\"&(I98+1),SIZE,\">0\")","v":0}]
[null,null,{"$f":"I98+1","v":"2020-09-20"},{"$f":"C101+1","v":"2020-09-21"},{"$f":"D101+1","v":"2020-09-22"},"2020-09-23","2020-09-24","2020-09-25","2020-09-26"]
[null,null,{"$f":"SUMIFS('TRADE LOG'!$T$15:$T$9733,closeDate,\">\"&CALENDAR!C101,closeDate,\"<=\"&D101,SIZE,\">0\")","v":0},{"$f":"SUMIFS('TRADE LOG'!$T$15:$T$9733,closeDate,\">\"&CALENDAR!D101,closeDate,\"<=\"&E101,SIZE,\">0\")","v":0},{"$f":"SUMIFS('TRADE LOG'!$T$15:$T$9733,closeDate,\">\"&CALENDAR!E101,closeDate,\"<=\"&F101,SIZE,\">0\")","v":0},{"$f":"SUMIFS('TRADE LOG'!$T$15:$T$9733,closeDate,\">\"&CALENDAR!F101,closeDate,\"<=\"&G101,SIZE,\">0\")","v":0},{"$f":"SUMIFS('TRADE LOG'!$T$15:$T$9733,closeDate,\">\"&CALENDAR!G101,closeDate,\"<=\"&H101,SIZE,\">0\")","v":0},{"$f":"SUMIFS('TRADE LOG'!$T$15:$T$9733,closeDate,\">\"&CALENDAR!H101,closeDate,\"<=\"&I101,SIZE,\">0\")","v":0},{"$f":"SUMIFS('TRADE LOG'!$T$15:$T$9733,closeDate,\">\"&CALENDAR!I101,closeDate,\"<=\"&C104,SIZE,\">0\")","v":0}]
[null,null,{"$f":"COUNTIFS(closeDate,\">\"&CALENDAR!C101,closeDate,\"<=\"&D101,SIZE,\">0\")","v":0},{"$f":"COUNTIFS(closeDate,\">\"&CALENDAR!D101,closeDate,\"<=\"&E101,SIZE,\">0\")","v":0},{"$f":"COUNTIFS(closeDate,\">\"&CALENDAR!E101,closeDate,\"<=\"&F101,SIZE,\">0\")","v":0},{"$f":"COUNTIFS(closeDate,\">\"&CALENDAR!F101,closeDate,\"<=\"&G101,SIZE,\">0\")","v":0},{"$f":"COUNTIFS(closeDate,\">\"&CALENDAR!G101,closeDate,\"<=\"&H101,SIZE,\">0\")","v":0},{"$f":"COUNTIFS(closeDate,\">\"&CALENDAR!H101,closeDate,\"<=\"&I101,SIZE,\">0\")","v":0},{"$f":"COUNTIFS(closeDate,\">\"&CALENDAR!I101,closeDate,\"<=\"&(I101+1),SIZE,\">0\")","v":0}]
[null,null,{"$f":"IFERROR(IF(MONTH(C90)<>MONTH(I101+1),\"\",(I101+1)),\"\")","v":"2020-09-27"},{"$f":"IFERROR(IF(MONTH(C90)<>MONTH(C104+1),\"\",(C104+1)),\"\")","v":"2020-09-28"},{"$f":"IFERROR(IF(MONTH(C90)<>MONTH(D104+1),\"\",(D104+1)),\"\")","v":"2020-09-29"},{"$f":"IFERROR(IF(MONTH(C90)<>MONTH(E104+1),\"\",(E104+1)),\"\")","v":"2020-09-30"},{"$f":"IFERROR(IF(MONTH(C90)<>MONTH(F104+1),\"\",(F104+1)),\"\")","v":""},{"$f":"IFERROR(IF(MONTH(C90)<>MONTH(G104+1),\"\",(G104+1)),\"\")","v":""},{"$f":"IFERROR(IF(MONTH(C90)<>MONTH(H104+1),\"\",(H104+1)),\"\")","v":""}]
[null,null,{"$f":"SUMIFS('TRADE LOG'!$T$15:$T$9733,closeDate,\">\"&CALENDAR!C104,closeDate,\"<=\"&D104,SIZE,\">0\")","v":0},{"$f":"SUMIFS('TRADE LOG'!$T$15:$T$9733,closeDate,\">\"&CALENDAR!D104,closeDate,\"<=\"&E104,SIZE,\">0\")","v":0},{"$f":"SUMIFS('TRADE LOG'!$T$15:$T$9733,closeDate,\">\"&CALENDAR!E104,closeDate,\"<=\"&F104,SIZE,\">0\")","v":0},{"$f":"SUMIFS('TRADE LOG'!$T$15:$T$9733,closeDate,\">\"&CALENDAR!F104,closeDate,\"<=\"&G104,SIZE,\">0\")","v":0},{"$f":"SUMIFS('TRADE LOG'!$T$15:$T$9733,closeDate,\">\"&CALENDAR!G104,closeDate,\"<=\"&H104,SIZE,\">0\")","v":0},{"$f":"SUMIFS('TRADE LOG'!$T$15:$T$9733,closeDate,\">\"&CALENDAR!H104,closeDate,\"<=\"&I104,SIZE,\">0\")","v":0},{"$f":"SUMIFS('TRADE LOG'!$T$15:$T$9733,closeDate,\">\"&CALENDAR!I104,closeDate,\"<=\"&C107,SIZE,\">0\")","v":0}]
[null,null,{"$f":"COUNTIFS(closeDate,\">\"&CALENDAR!C104,closeDate,\"<=\"&D104,SIZE,\">0\")","v":0},{"$f":"COUNTIFS(closeDate,\">\"&CALENDAR!D104,closeDate,\"<=\"&E104,SIZE,\">0\")","v":0},{"$f":"COUNTIFS(closeDate,\">\"&CALENDAR!E104,closeDate,\"<=\"&F104,SIZE,\">0\")","v":0},{"$f":"COUNTIFS(closeDate,\">\"&CALENDAR!F104,closeDate,\"<=\"&G104,SIZE,\">0\")","v":0},{"$f":"COUNTIFS(closeDate,\">\"&CALENDAR!G104,closeDate,\"<=\"&H104,SIZE,\">0\")","v":0},{"$f":"COUNTIFS(closeDate,\">\"&CALENDAR!H104,closeDate,\"<=\"&I104,SIZE,\">0\")","v":0},{"$f":"COUNTIFS(closeDate,\">\"&CALENDAR!I104,closeDate,\"<=\"&(I104+1),SIZE,\">0\")","v":0}]
[null,null,{"$f":"IFERROR(IF(MONTH(C90)<>MONTH(I104+1),\"\",(I104+1)),\"\")","v":""},{"$f":"IFERROR(IF(MONTH(C90)<>MONTH(C107+1),\"\",(C107+1)),\"\")","v":""},{"$f":"IFERROR(IF(MONTH(C90)<>MONTH(D107+1),\"\",(D107+1)),\"\")","v":""},{"$f":"IFERROR(IF(MONTH(C90)<>MONTH(E107+1),\"\",(E107+1)),\"\")","v":""},{"$f":"IFERROR(IF(MONTH(C90)<>MONTH(F107+1),\"\",(F107+1)),\"\")","v":""},{"$f":"IFERROR(IF(MONTH(C90)<>MONTH(G107+1),\"\",(G107+1)),\"\")","v":""},{"$f":"IFERROR(IF(MONTH(C90)<>MONTH(H107+1),\"\",(H107+1)),\"\")","v":""}]
[null,null,{"$f":"SUMIFS('TRADE LOG'!$T$15:$T$9733,closeDate,\">\"&CALENDAR!C107,closeDate,\"<=\"&D107,SIZE,\">0\")","v":0},{"$f":"SUMIFS('TRADE LOG'!$T$15:$T$9733,closeDate,\">\"&CALENDAR!D107,closeDate,\"<=\"&E107,SIZE,\">0\")","v":0},{"$f":"SUMIFS('TRADE LOG'!$T$15:$T$9733,closeDate,\">\"&CALENDAR!E107,closeDate,\"<=\"&F107,SIZE,\">0\")","v":0},{"$f":"SUMIFS('TRADE LOG'!$T$15:$T$9733,closeDate,\">\"&CALENDAR!F107,closeDate,\"<=\"&G107,SIZE,\">0\")","v":0},{"$f":"SUMIFS('TRADE LOG'!$T$15:$T$9733,closeDate,\">\"&CALENDAR!G107,closeDate,\"<=\"&H107,SIZE,\">0\")","v":0},{"$f":"SUMIFS('TRADE LOG'!$T$15:$T$9733,closeDate,\">\"&CALENDAR!H107,closeDate,\"<=\"&I107,SIZE,\">0\")","v":0},{"$f":"SUMIFS('TRADE LOG'!$T$15:$T$9733,closeDate,\">\"&CALENDAR!I107,closeDate,\"<=\"&C110,SIZE,\">0\")","v":0}]
[null,null,{"$f":"COUNTIFS(closeDate,\">\"&CALENDAR!C107,closeDate,\"<=\"&D107,SIZE,\">0\")","v":0},{"$f":"COUNTIFS(closeDate,\">\"&CALENDAR!D107,closeDate,\"<=\"&E107,SIZE,\">0\")","v":0},{"$f":"COUNTIFS(closeDate,\">\"&CALENDAR!E107,closeDate,\"<=\"&F107,SIZE,\">0\")","v":0},{"$f":"COUNTIFS(closeDate,\">\"&CALENDAR!F107,closeDate,\"<=\"&G107,SIZE,\">0\")","v":0},{"$f":"COUNTIFS(closeDate,\">\"&CALENDAR!G107,closeDate,\"<=\"&H107,SIZE,\">0\")","v":0},{"$f":"COUNTIFS(closeDate,\">\"&CALENDAR!H107,closeDate,\"<=\"&I107,SIZE,\">0\")","v":0},{"$f":"COUNTIFS(closeDate,\">\"&CALENDAR!I107,closeDate,\"<=\"&(I107+1),SIZE,\">0\")","v":0}]
[]
[null,null,{"$f":"EOMONTH(C90,0)+1","v":"2020-10-01"}]
[null,null,"SUN","MON","TUE","WED","THU","FRI","SAT"]
[null,null,{"$f":"IF(MONTH(C111)<>MONTH((C111-WEEKDAY(C111,1)+1)),\"\",(C111-WEEKDAY(C111,1)+1))","v":""},{"$f":"IF(MONTH(C111)<>MONTH((C111-WEEKDAY(C111,1)+2)),\"\",(C111-WEEKDAY(C111,1)+2))","v":""},{"$f":"IF(MONTH(C111)<>MONTH((C111-WEEKDAY(C111,1)+3)),\"\",(C111-WEEKDAY(C111,1)+3))","v":""},{"$f":"IF(MONTH(C111)<>MONTH((C111-WEEKDAY(C111,1)+4)),\"\",(C111-WEEKDAY(C111,1)+4))","v":""},{"$f":"IF(MONTH(C111)<>MONTH((C111-WEEKDAY(C111,1)+5)),\"\",(C111-WEEKDAY(C111,1)+5))","v":"2020-10-01"},{"$f":"IF(MONTH(C111)<>MONTH((C111-WEEKDAY(C111,1)+6)),\"\",(C111-WEEKDAY(C111,1)+6))","v":"2020-10-02"},{"$f":"IF(MONTH(C111)<>MONTH((C111-WEEKDAY(C111,1)+7)),\"\",(C111-WEEKDAY(C111,1)+7))","v":"2020-10-03"}]
[null,null,{"$f":"SUMIFS('TRADE LOG'!$T$15:$T$9733,closeDate,\">\"&CALENDAR!C113,closeDate,\"<=\"&D113,SIZE,\">0\")","v":0},{"$f":"SUMIFS('TRADE LOG'!$T$15:$T$9733,closeDate,\">\"&CALENDAR!D113,closeDate,\"<=\"&E113,SIZE,\">0\")","v":0},{"$f":"SUMIFS('TRADE LOG'!$T$15:$T$9733,closeDate,\">\"&CALENDAR!E113,closeDate,\"<=\"&F113,SIZE,\">0\")","v":0},{"$f":"SUMIFS('TRADE LOG'!$T$15:$T$9733,closeDate,\">\"&CALENDAR!F113,closeDate,\"<=\"&G113,SIZE,\">0\")","v":0},{"$f":"SUMIFS('TRADE LOG'!$T$15:$T$9733,closeDate,\">\"&CALENDAR!G113,closeDate,\"<=\"&H113,SIZE,\">0\")","v":0},{"$f":"SUMIFS('TRADE LOG'!$T$15:$T$9733,closeDate,\">\"&CALENDAR!H113,closeDate,\"<=\"&I113,SIZE,\">0\")","v":0},{"$f":"SUMIFS('TRADE LOG'!$T$15:$T$9733,closeDate,\">\"&CALENDAR!I113,closeDate,\"<=\"&C116,SIZE,\">0\")","v":0}]
[null,null,{"$f":"COUNTIFS(closeDate,\">\"&CALENDAR!C113,closeDate,\"<=\"&D113,SIZE,\">0\")","v":0},{"$f":"COUNTIFS(closeDate,\">\"&CALENDAR!D113,closeDate,\"<=\"&E113,SIZE,\">0\")","v":0},{"$f":"COUNTIFS(closeDate,\">\"&CALENDAR!E113,closeDate,\"<=\"&F113,SIZE,\">0\")","v":0},{"$f":"COUNTIFS(closeDate,\">\"&CALENDAR!F113,closeDate,\"<=\"&G113,SIZE,\">0\")","v":0},{"$f":"COUNTIFS(closeDate,\">\"&CALENDAR!G113,closeDate,\"<=\"&H113,SIZE,\">0\")","v":0},{"$f":"COUNTIFS(closeDate,\">\"&CALENDAR!H113,closeDate,\"<=\"&I113,SIZE,\">0\")","v":0},{"$f":"COUNTIFS(closeDate,\">\"&CALENDAR!I113,closeDate,\"<=\"&(I113+1),SIZE,\">0\")","v":0}]
[null,null,{"$f":"I113+1","v":"2020-10-04"},{"$f":"C116+1","v":"2020-10-05"},{"$f":"D116+1","v":"2020-10-06"},"2020-10-07","2020-10-08","2020-10-09","2020-10-10"]
[null,null,{"$f":"SUMIFS('TRADE LOG'!$T$15:$T$9733,closeDate,\">\"&CALENDAR!C116,closeDate,\"<=\"&D116,SIZE,\">0\")","v":0},{"$f":"SUMIFS('TRADE LOG'!$T$15:$T$9733,closeDate,\">\"&CALENDAR!D116,closeDate,\"<=\"&E116,SIZE,\">0\")","v":0},{"$f":"SUMIFS('TRADE LOG'!$T$15:$T$9733,closeDate,\">\"&CALENDAR!E116,closeDate,\"<=\"&F116,SIZE,\">0\")","v":0},{"$f":"SUMIFS('TRADE LOG'!$T$15:$T$9733,closeDate,\">\"&CALENDAR!F116,closeDate,\"<=\"&G116,SIZE,\">0\")","v":0},{"$f":"SUMIFS('TRADE LOG'!$T$15:$T$9733,closeDate,\">\"&CALENDAR!G116,closeDate,\"<=\"&H116,SIZE,\">0\")","v":0},{"$f":"SUMIFS('TRADE LOG'!$T$15:$T$9733,closeDate,\">\"&CALENDAR!H116,closeDate,\"<=\"&I116,SIZE,\">0\")","v":0},{"$f":"SUMIFS('TRADE LOG'!$T$15:$T$9733,closeDate,\">\"&CALENDAR!I116,closeDate,\"<=\"&C119,SIZE,\">0\")","v":0}]
[null,null,{"$f":"COUNTIFS(closeDate,\">\"&CALENDAR!C116,closeDate,\"<=\"&D116,SIZE,\">0\")","v":0},{"$f":"COUNTIFS(closeDate,\">\"&CALENDAR!D116,closeDate,\"<=\"&E116,SIZE,\">0\")","v":0},{"$f":"COUNTIFS(closeDate,\">\"&CALENDAR!E116,closeDate,\"<=\"&F116,SIZE,\">0\")","v":0},{"$f":"COUNTIFS(closeDate,\">\"&CALENDAR!F116,closeDate,\"<=\"&G116,SIZE,\">0\")","v":0},{"$f":"COUNTIFS(closeDate,\">\"&CALENDAR!G116,closeDate,\"<=\"&H116,SIZE,\">0\")","v":0},{"$f":"COUNTIFS(closeDate,\">\"&CALENDAR!H116,closeDate,\"<=\"&I116,SIZE,\">0\")","v":0},{"$f":"COUNTIFS(closeDate,\">\"&CALENDAR!I116,closeDate,\"<=\"&(I116+1),SIZE,\">0\")","v":0}]
[null,null,{"$f":"I116+1","v":"2020-10-11"},{"$f":"C119+1","v":"2020-10-12"},{"$f":"D119+1","v":"2020-10-13"},"2020-10-14","2020-10-15","2020-10-16","2020-10-17"]
[null,null,{"$f":"SUMIFS('TRADE LOG'!$T$15:$T$9733,closeDate,\">\"&CALENDAR!C119,closeDate,\"<=\"&D119,SIZE,\">0\")","v":0},{"$f":"SUMIFS('TRADE LOG'!$T$15:$T$9733,closeDate,\">\"&CALENDAR!D119,closeDate,\"<=\"&E119,SIZE,\">0\")","v":0},{"$f":"SUMIFS('TRADE LOG'!$T$15:$T$9733,closeDate,\">\"&CALENDAR!E119,closeDate,\"<=\"&F119,SIZE,\">0\")","v":0},{"$f":"SUMIFS('TRADE LOG'!$T$15:$T$9733,closeDate,\">\"&CALENDAR!F119,closeDate,\"<=\"&G119,SIZE,\">0\")","v":0},{"$f":"SUMIFS('TRADE LOG'!$T$15:$T$9733,closeDate,\">\"&CALENDAR!G119,closeDate,\"<=\"&H119,SIZE,\">0\")","v":0},{"$f":"SUMIFS('TRADE LOG'!$T$15:$T$9733,closeDate,\">\"&CALENDAR!H119,closeDate,\"<=\"&I119,SIZE,\">0\")","v":0},{"$f":"SUMIFS('TRADE LOG'!$T$15:$T$9733,closeDate,\">\"&CALENDAR!I119,closeDate,\"<=\"&C122,SIZE,\">0\")","v":0}]
[null,null,{"$f":"COUNTIFS(closeDate,\">\"&CALENDAR!C119,closeDate,\"<=\"&D119,SIZE,\">0\")","v":0},{"$f":"COUNTIFS(closeDate,\">\"&CALENDAR!D119,closeDate,\"<=\"&E119,SIZE,\">0\")","v":0},{"$f":"COUNTIFS(closeDate,\">\"&CALENDAR!E119,closeDate,\"<=\"&F119,SIZE,\">0\")","v":0},{"$f":"COUNTIFS(closeDate,\">\"&CALENDAR!F119,closeDate,\"<=\"&G119,SIZE,\">0\")","v":0},{"$f":"COUNTIFS(closeDate,\">\"&CALENDAR!G119,closeDate,\"<=\"&H119,SIZE,\">0\")","v":0},{"$f":"COUNTIFS(closeDate,\">\"&CALENDAR!H119,closeDate,\"<=\"&I119,SIZE,\">0\")","v":0},{"$f":"COUNTIFS(closeDate,\">\"&CALENDAR!I119,closeDate,\"<=\"&(I119+1),SIZE,\">0\")","v":0}]
[null,null,{"$f":"I119+1","v":"2020-10-18"},{"$f":"C122+1","v":"2020-10-19"},{"$f":"D122+1","v":"2020-10-20"},"2020-10-21","2020-10-22","2020-10-23","2020-10-24"]
[null,null,{"$f":"SUMIFS('TRADE LOG'!$T$15:$T$9733,closeDate,\">\"&CALENDAR!C122,closeDate,\"<=\"&D122,SIZE,\">0\")","v":0},{"$f":"SUMIFS('TRADE LOG'!$T$15:$T$9733,closeDate,\">\"&CALENDAR!D122,closeDate,\"<=\"&E122,SIZE,\">0\")","v":0},{"$f":"SUMIFS('TRADE LOG'!$T$15:$T$9733,closeDate,\">\"&CALENDAR!E122,closeDate,\"<=\"&F122,SIZE,\">0\")","v":0},{"$f":"SUMIFS('TRADE LOG'!$T$15:$T$9733,closeDate,\">\"&CALENDAR!F122,closeDate,\"<=\"&G122,SIZE,\">0\")","v":0},{"$f":"SUMIFS('TRADE LOG'!$T$15:$T$9733,closeDate,\">\"&CALENDAR!G122,closeDate,\"<=\"&H122,SIZE,\">0\")","v":0},{"$f":"SUMIFS('TRADE LOG'!$T$15:$T$9733,closeDate,\">\"&CALENDAR!H122,closeDate,\"<=\"&I122,SIZE,\">0\")","v":0},{"$f":"SUMIFS('TRADE LOG'!$T$15:$T$9733,closeDate,\">\"&CALENDAR!I122,closeDate,\"<=\"&C125,SIZE,\">0\")","v":0}]
[null,null,{"$f":"COUNTIFS(closeDate,\">\"&CALENDAR!C122,closeDate,\"<=\"&D122,SIZE,\">0\")","v":0},{"$f":"COUNTIFS(closeDate,\">\"&CALENDAR!D122,closeDate,\"<=\"&E122,SIZE,\">0\")","v":0},{"$f":"COUNTIFS(closeDate,\">\"&CALENDAR!E122,closeDate,\"<=\"&F122,SIZE,\">0\")","v":0},{"$f":"COUNTIFS(closeDate,\">\"&CALENDAR!F122,closeDate,\"<=\"&G122,SIZE,\">0\")","v":0},{"$f":"COUNTIFS(closeDate,\">\"&CALENDAR!G122,closeDate,\"<=\"&H122,SIZE,\">0\")","v":0},{"$f":"COUNTIFS(closeDate,\">\"&CALENDAR!H122,closeDate,\"<=\"&I122,SIZE,\">0\")","v":0},{"$f":"COUNTIFS(closeDate,\">\"&CALENDAR!I122,closeDate,\"<=\"&(I122+1),SIZE,\">0\")","v":0}]
[null,null,{"$f":"IFERROR(IF(MONTH(C111)<>MONTH(I122+1),\"\",(I122+1)),\"\")","v":"2020-10-25"},{"$f":"IFERROR(IF(MONTH(C111)<>MONTH(C125+1),\"\",(C125+1)),\"\")","v":"2020-10-26"},{"$f":"IFERROR(IF(MONTH(C111)<>MONTH(D125+1),\"\",(D125+1)),\"\")","v":"2020-10-27"},{"$f":"IFERROR(IF(MONTH(C111)<>MONTH(E125+1),\"\",(E125+1)),\"\")","v":"2020-10-28"},{"$f":"IFERROR(IF(MONTH(C111)<>MONTH(F125+1),\"\",(F125+1)),\"\")","v":"2020-10-29"},{"$f":"IFERROR(IF(MONTH(C111)<>MONTH(G125+1),\"\",(G125+1)),\"\")","v":"2020-10-30"},{"$f":"IFERROR(IF(MONTH(C111)<>MONTH(H125+1),\"\",(H125+1)),\"\")","v":"2020-10-31"}]
[null,null,{"$f":"SUMIFS('TRADE LOG'!$T$15:$T$9733,closeDate,\">\"&CALENDAR!C125,closeDate,\"<=\"&D125,SIZE,\">0\")","v":0},{"$f":"SUMIFS('TRADE LOG'!$T$15:$T$9733,closeDate,\">\"&CALENDAR!D125,closeDate,\"<=\"&E125,SIZE,\">0\")","v":0},{"$f":"SUMIFS('TRADE LOG'!$T$15:$T$9733,closeDate,\">\"&CALENDAR!E125,closeDate,\"<=\"&F125,SIZE,\">0\")","v":0},{"$f":"SUMIFS('TRADE LOG'!$T$15:$T$9733,closeDate,\">\"&CALENDAR!F125,closeDate,\"<=\"&G125,SIZE,\">0\")","v":0},{"$f":"SUMIFS('TRADE LOG'!$T$15:$T$9733,closeDate,\">\"&CALENDAR!G125,closeDate,\"<=\"&H125,SIZE,\">0\")","v":0},{"$f":"SUMIFS('TRADE LOG'!$T$15:$T$9733,closeDate,\">\"&CALENDAR!H125,closeDate,\"<=\"&I125,SIZE,\">0\")","v":0},{"$f":"SUMIFS('TRADE LOG'!$T$15:$T$9733,closeDate,\">\"&CALENDAR!I125,closeDate,\"<=\"&C128,SIZE,\">0\")","v":0}]
[null,null,{"$f":"COUNTIFS(closeDate,\">\"&CALENDAR!C125,closeDate,\"<=\"&D125,SIZE,\">0\")","v":0},{"$f":"COUNTIFS(closeDate,\">\"&CALENDAR!D125,closeDate,\"<=\"&E125,SIZE,\">0\")","v":0},{"$f":"COUNTIFS(closeDate,\">\"&CALENDAR!E125,closeDate,\"<=\"&F125,SIZE,\">0\")","v":0},{"$f":"COUNTIFS(closeDate,\">\"&CALENDAR!F125,closeDate,\"<=\"&G125,SIZE,\">0\")","v":0},{"$f":"COUNTIFS(closeDate,\">\"&CALENDAR!G125,closeDate,\"<=\"&H125,SIZE,\">0\")","v":0},{"$f":"COUNTIFS(closeDate,\">\"&CALENDAR!H125,closeDate,\"<=\"&I125,SIZE,\">0\")","v":0},{"$f":"COUNTIFS(closeDate,\">\"&CALENDAR!I125,closeDate,\"<=\"&(I125+1),SIZE,\">0\")","v":0}]
[null,null,{"$f":"IFERROR(IF(MONTH(C111)<>MONTH(I125+1),\"\",(I125+1)),\"\")","v":""},{"$f":"IFERROR(IF(MONTH(C111)<>MONTH(C128+1),\"\",(C128+1)),\"\")","v":""},{"$f":"IFERROR(IF(MONTH(C111)<>MONTH(D128+1),\"\",(D128+1)),\"\")","v":""},{"$f":"IFERROR(IF(MONTH(C111)<>MONTH(E128+1),\"\",(E128+1)),\"\")","v":""},{"$f":"IFERROR(IF(MONTH(C111)<>MONTH(F128+1),\"\",(F128+1)),\"\")","v":""},{"$f":"IFERROR(IF(MONTH(C111)<>MONTH(G128+1),\"\",(G128+1)),\"\")","v":""},{"$f":"IFERROR(IF(MONTH(C111)<>MONTH(H128+1),\"\",(H128+1)),\"\")","v":""}]
[null,null,{"$f":"SUMIFS('TRADE LOG'!$T$15:$T$9733,closeDate,\">\"&CALENDAR!C128,closeDate,\"<=\"&D128,SIZE,\">0\")","v":0},{"$f":"SUMIFS('TRADE LOG'!$T$15:$T$9733,closeDate,\">\"&CALENDAR!D128,closeDate,\"<=\"&E128,SIZE,\">0\")","v":0},{"$f":"SUMIFS('TRADE LOG'!$T$15:$T$9733,closeDate,\">\"&CALENDAR!E128,closeDate,\"<=\"&F128,SIZE,\">0\")","v":0},{"$f":"SUMIFS('TRADE LOG'!$T$15:$T$9733,closeDate,\">\"&CALENDAR!F128,closeDate,\"<=\"&G128,SIZE,\">0\")","v":0},{"$f":"SUMIFS('TRADE LOG'!$T$15:$T$9733,closeDate,\">\"&CALENDAR!G128,closeDate,\"<=\"&H128,SIZE,\">0\")","v":0},{"$f":"SUMIFS('TRADE LOG'!$T$15:$T$9733,closeDate,\">\"&CALENDAR!H128,closeDate,\"<=\"&I128,SIZE,\">0\")","v":0},{"$f":"SUMIFS('TRADE LOG'!$T$15:$T$9733,closeDate,\">\"&CALENDAR!I128,closeDate,\"<=\"&C131,SIZE,\">0\")","v":0}]
[null,null,{"$f":"COUNTIFS(closeDate,\">\"&CALENDAR!C128,closeDate,\"<=\"&D128,SIZE,\">0\")","v":0},{"$f":"COUNTIFS(closeDate,\">\"&CALENDAR!D128,closeDate,\"<=\"&E128,SIZE,\">0\")","v":0},{"$f":"COUNTIFS(closeDate,\">\"&CALENDAR!E128,closeDate,\"<=\"&F128,SIZE,\">0\")","v":0},{"$f":"COUNTIFS(closeDate,\">\"&CALENDAR!F128,closeDate,\"<=\"&G128,SIZE,\">0\")","v":0},{"$f":"COUNTIFS(closeDate,\">\"&CALENDAR!G128,closeDate,\"<=\"&H128,SIZE,\">0\")","v":0},{"$f":"COUNTIFS(closeDate,\">\"&CALENDAR!H128,closeDate,\"<=\"&I128,SIZE,\">0\")","v":0},{"$f":"COUNTIFS(closeDate,\">\"&CALENDAR!I128,closeDate,\"<=\"&(I128+1),SIZE,\">0\")","v":0}]
[]
[null,null,{"$f":"EOMONTH(C111,0)+1","v":"2020-11-01"}]
[null,null,"SUN","MON","TUE","WED","THU","FRI","SAT"]
[null,null,{"$f":"IF(MONTH(C132)<>MONTH((C132-WEEKDAY(C132,1)+1)),\"\",(C132-WEEKDAY(C132,1)+1))","v":"2020-11-01"},{"$f":"IF(MONTH(C132)<>MONTH((C132-WEEKDAY(C132,1)+2)),\"\",(C132-WEEKDAY(C132,1)+2))","v":"2020-11-02"},{"$f":"IF(MONTH(C132)<>MONTH((C132-WEEKDAY(C132,1)+3)),\"\",(C132-WEEKDAY(C132,1)+3))","v":"2020-11-03"},{"$f":"IF(MONTH(C132)<>MONTH((C132-WEEKDAY(C132,1)+4)),\"\",(C132-WEEKDAY(C132,1)+4))","v":"2020-11-04"},{"$f":"IF(MONTH(C132)<>MONTH((C132-WEEKDAY(C132,1)+5)),\"\",(C132-WEEKDAY(C132,1)+5))","v":"2020-11-05"},{"$f":"IF(MONTH(C132)<>MONTH((C132-WEEKDAY(C132,1)+6)),\"\",(C132-WEEKDAY(C132,1)+6))","v":"2020-11-06"},{"$f":"IF(MONTH(C132)<>MONTH((C132-WEEKDAY(C132,1)+7)),\"\",(C132-WEEKDAY(C132,1)+7))","v":"2020-11-07"}]
[null,null,{"$f":"SUMIFS('TRADE LOG'!$T$15:$T$9733,closeDate,\">\"&CALENDAR!C134,closeDate,\"<=\"&D134,SIZE,\">0\")","v":0},{"$f":"SUMIFS('TRADE LOG'!$T$15:$T$9733,closeDate,\">\"&CALENDAR!D134,closeDate,\"<=\"&E134,SIZE,\">0\")","v":0},{"$f":"SUMIFS('TRADE LOG'!$T$15:$T$9733,closeDate,\">\"&CALENDAR!E134,closeDate,\"<=\"&F134,SIZE,\">0\")","v":0},{"$f":"SUMIFS('TRADE LOG'!$T$15:$T$9733,closeDate,\">\"&CALENDAR!F134,closeDate,\"<=\"&G134,SIZE,\">0\")","v":0},{"$f":"SUMIFS('TRADE LOG'!$T$15:$T$9733,closeDate,\">\"&CALENDAR!G134,closeDate,\"<=\"&H134,SIZE,\">0\")","v":0},{"$f":"SUMIFS('TRADE LOG'!$T$15:$T$9733,closeDate,\">\"&CALENDAR!H134,closeDate,\"<=\"&I134,SIZE,\">0\")","v":0},{"$f":"SUMIFS('TRADE LOG'!$T$15:$T$9733,closeDate,\">\"&CALENDAR!I134,closeDate,\"<=\"&C137,SIZE,\">0\")","v":0}]
[null,null,{"$f":"COUNTIFS(closeDate,\">\"&CALENDAR!C134,closeDate,\"<=\"&D134,SIZE,\">0\")","v":0},{"$f":"COUNTIFS(closeDate,\">\"&CALENDAR!D134,closeDate,\"<=\"&E134,SIZE,\">0\")","v":0},{"$f":"COUNTIFS(closeDate,\">\"&CALENDAR!E134,closeDate,\"<=\"&F134,SIZE,\">0\")","v":0},{"$f":"COUNTIFS(closeDate,\">\"&CALENDAR!F134,closeDate,\"<=\"&G134,SIZE,\">0\")","v":0},{"$f":"COUNTIFS(closeDate,\">\"&CALENDAR!G134,closeDate,\"<=\"&H134,SIZE,\">0\")","v":0},{"$f":"COUNTIFS(closeDate,\">\"&CALENDAR!H134,closeDate,\"<=\"&I134,SIZE,\">0\")","v":0},{"$f":"COUNTIFS(closeDate,\">\"&CALENDAR!I134,closeDate,\"<=\"&(I134+1),SIZE,\">0\")","v":0}]
[null,null,{"$f":"I134+1","v":"2020-11-08"},{"$f":"C137+1","v":"2020-11-09"},{"$f":"D137+1","v":"2020-11-10"},"2020-11-11","2020-11-12","2020-11-13","2020-11-14"]
[null,null,{"$f":"SUMIFS('TRADE LOG'!$T$15:$T$9733,closeDate,\">\"&CALENDAR!C137,closeDate,\"<=\"&D137,SIZE,\">0\")","v":0},{"$f":"SUMIFS('TRADE LOG'!$T$15:$T$9733,closeDate,\">\"&CALENDAR!D137,closeDate,\"<=\"&E137,SIZE,\">0\")","v":0},{"$f":"SUMIFS('TRADE LOG'!$T$15:$T$9733,closeDate,\">\"&CALENDAR!E137,closeDate,\"<=\"&F137,SIZE,\">0\")","v":0},{"$f":"SUMIFS('TRADE LOG'!$T$15:$T$9733,closeDate,\">\"&CALENDAR!F137,closeDate,\"<=\"&G137,SIZE,\">0\")","v":0},{"$f":"SUMIFS('TRADE LOG'!$T$15:$T$9733,closeDate,\">\"&CALENDAR!G137,closeDate,\"<=\"&H137,SIZE,\">0\")","v":0},{"$f":"SUMIFS('TRADE LOG'!$T$15:$T$9733,closeDate,\">\"&CALENDAR!H137,closeDate,\"<=\"&I137,SIZE,\">0\")","v":0},{"$f":"SUMIFS('TRADE LOG'!$T$15:$T$9733,closeDate,\">\"&CALENDAR!I137,closeDate,\"<=\"&C140,SIZE,\">0\")","v":0}]
[null,null,{"$f":"COUNTIFS(closeDate,\">\"&CALENDAR!C137,closeDate,\"<=\"&D137,SIZE,\">0\")","v":0},{"$f":"COUNTIFS(closeDate,\">\"&CALENDAR!D137,closeDate,\"<=\"&E137,SIZE,\">0\")","v":0},{"$f":"COUNTIFS(closeDate,\">\"&CALENDAR!E137,closeDate,\"<=\"&F137,SIZE,\">0\")","v":0},{"$f":"COUNTIFS(closeDate,\">\"&CALENDAR!F137,closeDate,\"<=\"&G137,SIZE,\">0\")","v":0},{"$f":"COUNTIFS(closeDate,\">\"&CALENDAR!G137,closeDate,\"<=\"&H137,SIZE,\">0\")","v":0},{"$f":"COUNTIFS(closeDate,\">\"&CALENDAR!H137,closeDate,\"<=\"&I137,SIZE,\">0\")","v":0},{"$f":"COUNTIFS(closeDate,\">\"&CALENDAR!I137,closeDate,\"<=\"&(I137+1),SIZE,\">0\")","v":0}]
[null,null,{"$f":"I137+1","v":"2020-11-15"},{"$f":"C140+1","v":"2020-11-16"},{"$f":"D140+1","v":"2020-11-17"},"2020-11-18","2020-11-19","2020-11-20","2020-11-21"]
[null,null,{"$f":"SUMIFS('TRADE LOG'!$T$15:$T$9733,closeDate,\">\"&CALENDAR!C140,closeDate,\"<=\"&D140,SIZE,\">0\")","v":0},{"$f":"SUMIFS('TRADE LOG'!$T$15:$T$9733,closeDate,\">\"&CALENDAR!D140,closeDate,\"<=\"&E140,SIZE,\">0\")","v":0},{"$f":"SUMIFS('TRADE LOG'!$T$15:$T$9733,closeDate,\">\"&CALENDAR!E140,closeDate,\"<=\"&F140,SIZE,\">0\")","v":0},{"$f":"SUMIFS('TRADE LOG'!$T$15:$T$9733,closeDate,\">\"&CALENDAR!F140,closeDate,\"<=\"&G140,SIZE,\">0\")","v":0},{"$f":"SUMIFS('TRADE LOG'!$T$15:$T$9733,closeDate,\">\"&CALENDAR!G140,closeDate,\"<=\"&H140,SIZE,\">0\")","v":0},{"$f":"SUMIFS('TRADE LOG'!$T$15:$T$9733,closeDate,\">\"&CALENDAR!H140,closeDate,\"<=\"&I140,SIZE,\">0\")","v":0},{"$f":"SUMIFS('TRADE LOG'!$T$15:$T$9733,closeDate,\">\"&CALENDAR!I140,closeDate,\"<=\"&C143,SIZE,\">0\")","v":0}]
[null,null,{"$f":"COUNTIFS(closeDate,\">\"&CALENDAR!C140,closeDate,\"<=\"&D140,SIZE,\">0\")","v":0},{"$f":"COUNTIFS(closeDate,\">\"&CALENDAR!D140,closeDate,\"<=\"&E140,SIZE,\">0\")","v":0},{"$f":"COUNTIFS(closeDate,\">\"&CALENDAR!E140,closeDate,\"<=\"&F140,SIZE,\">0\")","v":0},{"$f":"COUNTIFS(closeDate,\">\"&CALENDAR!F140,closeDate,\"<=\"&G140,SIZE,\">0\")","v":0},{"$f":"COUNTIFS(closeDate,\">\"&CALENDAR!G140,closeDate,\"<=\"&H140,SIZE,\">0\")","v":0},{"$f":"COUNTIFS(closeDate,\">\"&CALENDAR!H140,closeDate,\"<=\"&I140,SIZE,\">0\")","v":0},{"$f":"COUNTIFS(closeDate,\">\"&CALENDAR!I140,closeDate,\"<=\"&(I140+1),SIZE,\">0\")","v":0}]
[null,null,{"$f":"I140+1","v":"2020-11-22"},{"$f":"C143+1","v":"2020-11-23"},{"$f":"D143+1","v":"2020-11-24"},"2020-11-25","2020-11-26","2020-11-27","2020-11-28"]
[null,null,{"$f":"SUMIFS('TRADE LOG'!$T$15:$T$9733,closeDate,\">\"&CALENDAR!C143,closeDate,\"<=\"&D143,SIZE,\">0\")","v":0},{"$f":"SUMIFS('TRADE LOG'!$T$15:$T$9733,closeDate,\">\"&CALENDAR!D143,closeDate,\"<=\"&E143,SIZE,\">0\")","v":0},{"$f":"SUMIFS('TRADE LOG'!$T$15:$T$9733,closeDate,\">\"&CALENDAR!E143,closeDate,\"<=\"&F143,SIZE,\">0\")","v":0},{"$f":"SUMIFS('TRADE LOG'!$T$15:$T$9733,closeDate,\">\"&CALENDAR!F143,closeDate,\"<=\"&G143,SIZE,\">0\")","v":0},{"$f":"SUMIFS('TRADE LOG'!$T$15:$T$9733,closeDate,\">\"&CALENDAR!G143,closeDate,\"<=\"&H143,SIZE,\">0\")","v":0},{"$f":"SUMIFS('TRADE LOG'!$T$15:$T$9733,closeDate,\">\"&CALENDAR!H143,closeDate,\"<=\"&I143,SIZE,\">0\")","v":0},{"$f":"SUMIFS('TRADE LOG'!$T$15:$T$9733,closeDate,\">\"&CALENDAR!I143,closeDate,\"<=\"&C146,SIZE,\">0\")","v":0}]
[null,null,{"$f":"COUNTIFS(closeDate,\">\"&CALENDAR!C143,closeDate,\"<=\"&D143,SIZE,\">0\")","v":0},{"$f":"COUNTIFS(closeDate,\">\"&CALENDAR!D143,closeDate,\"<=\"&E143,SIZE,\">0\")","v":0},{"$f":"COUNTIFS(closeDate,\">\"&CALENDAR!E143,closeDate,\"<=\"&F143,SIZE,\">0\")","v":0},{"$f":"COUNTIFS(closeDate,\">\"&CALENDAR!F143,closeDate,\"<=\"&G143,SIZE,\">0\")","v":0},{"$f":"COUNTIFS(closeDate,\">\"&CALENDAR!G143,closeDate,\"<=\"&H143,SIZE,\">0\")","v":0},{"$f":"COUNTIFS(closeDate,\">\"&CALENDAR!H143,closeDate,\"<=\"&I143,SIZE,\">0\")","v":0},{"$f":"COUNTIFS(closeDate,\">\"&CALENDAR!I143,closeDate,\"<=\"&(I143+1),SIZE,\">0\")","v":0}]
[null,null,{"$f":"IFERROR(IF(MONTH(C132)<>MONTH(I143+1),\"\",(I143+1)),\"\")","v":"2020-11-29"},{"$f":"IFERROR(IF(MONTH(C132)<>MONTH(C146+1),\"\",(C146+1)),\"\")","v":"2020-11-30"},{"$f":"IFERROR(IF(MONTH(C132)<>MONTH(D146+1),\"\",(D146+1)),\"\")","v":""},{"$f":"IFERROR(IF(MONTH(C132)<>MONTH(E146+1),\"\",(E146+1)),\"\")","v":""},{"$f":"IFERROR(IF(MONTH(C132)<>MONTH(F146+1),\"\",(F146+1)),\"\")","v":""},{"$f":"IFERROR(IF(MONTH(C132)<>MONTH(G146+1),\"\",(G146+1)),\"\")","v":""},{"$f":"IFERROR(IF(MONTH(C132)<>MONTH(H146+1),\"\",(H146+1)),\"\")","v":""}]
[null,null,{"$f":"SUMIFS('TRADE LOG'!$T$15:$T$9733,closeDate,\">\"&CALENDAR!C146,closeDate,\"<=\"&D146,SIZE,\">0\")","v":0},{"$f":"SUMIFS('TRADE LOG'!$T$15:$T$9733,closeDate,\">\"&CALENDAR!D146,closeDate,\"<=\"&E146,SIZE,\">0\")","v":0},{"$f":"SUMIFS('TRADE LOG'!$T$15:$T$9733,closeDate,\">\"&CALENDAR!E146,closeDate,\"<=\"&F146,SIZE,\">0\")","v":0},{"$f":"SUMIFS('TRADE LOG'!$T$15:$T$9733,closeDate,\">\"&CALENDAR!F146,closeDate,\"<=\"&G146,SIZE,\">0\")","v":0},{"$f":"SUMIFS('TRADE LOG'!$T$15:$T$9733,closeDate,\">\"&CALENDAR!G146,closeDate,\"<=\"&H146,SIZE,\">0\")","v":0},{"$f":"SUMIFS('TRADE LOG'!$T$15:$T$9733,closeDate,\">\"&CALENDAR!H146,closeDate,\"<=\"&I146,SIZE,\">0\")","v":0},{"$f":"SUMIFS('TRADE LOG'!$T$15:$T$9733,closeDate,\">\"&CALENDAR!I146,closeDate,\"<=\"&C149,SIZE,\">0\")","v":0}]
[null,null,{"$f":"COUNTIFS(closeDate,\">\"&CALENDAR!C146,closeDate,\"<=\"&D146,SIZE,\">0\")","v":0},{"$f":"COUNTIFS(closeDate,\">\"&CALENDAR!D146,closeDate,\"<=\"&E146,SIZE,\">0\")","v":0},{"$f":"COUNTIFS(closeDate,\">\"&CALENDAR!E146,closeDate,\"<=\"&F146,SIZE,\">0\")","v":0},{"$f":"COUNTIFS(closeDate,\">\"&CALENDAR!F146,closeDate,\"<=\"&G146,SIZE,\">0\")","v":0},{"$f":"COUNTIFS(closeDate,\">\"&CALENDAR!G146,closeDate,\"<=\"&H146,SIZE,\">0\")","v":0},{"$f":"COUNTIFS(closeDate,\">\"&CALENDAR!H146,closeDate,\"<=\"&I146,SIZE,\">0\")","v":0},{"$f":"COUNTIFS(closeDate,\">\"&CALENDAR!I146,closeDate,\"<=\"&(I146+1),SIZE,\">0\")","v":0}]
[null,null,{"$f":"IFERROR(IF(MONTH(C132)<>MONTH(I146+1),\"\",(I146+1)),\"\")","v":""},{"$f":"IFERROR(IF(MONTH(C132)<>MONTH(C149+1),\"\",(C149+1)),\"\")","v":""},{"$f":"IFERROR(IF(MONTH(C132)<>MONTH(D149+1),\"\",(D149+1)),\"\")","v":""},{"$f":"IFERROR(IF(MONTH(C132)<>MONTH(E149+1),\"\",(E149+1)),\"\")","v":""},{"$f":"IFERROR(IF(MONTH(C132)<>MONTH(F149+1),\"\",(F149+1)),\"\")","v":""},{"$f":"IFERROR(IF(MONTH(C132)<>MONTH(G149+1),\"\",(G149+1)),\"\")","v":""},{"$f":"IFERROR(IF(MONTH(C132)<>MONTH(H149+1),\"\",(H149+1)),\"\")","v":""}]
[null,null,{"$f":"SUMIFS('TRADE LOG'!$T$15:$T$9733,closeDate,\">\"&CALENDAR!C149,closeDate,\"<=\"&D149,SIZE,\">0\")","v":0},{"$f":"SUMIFS('TRADE LOG'!$T$15:$T$9733,closeDate,\">\"&CALENDAR!D149,closeDate,\"<=\"&E149,SIZE,\">0\")","v":0},{"$f":"SUMIFS('TRADE LOG'!$T$15:$T$9733,closeDate,\">\"&CALENDAR!E149,closeDate,\"<=\"&F149,SIZE,\">0\")","v":0},{"$f":"SUMIFS('TRADE LOG'!$T$15:$T$9733,closeDate,\">\"&CALENDAR!F149,closeDate,\"<=\"&G149,SIZE,\">0\")","v":0},{"$f":"SUMIFS('TRADE LOG'!$T$15:$T$9733,closeDate,\">\"&CALENDAR!G149,closeDate,\"<=\"&H149,SIZE,\">0\")","v":0},{"$f":"SUMIFS('TRADE LOG'!$T$15:$T$9733,closeDate,\">\"&CALENDAR!H149,closeDate,\"<=\"&I149,SIZE,\">0\")","v":0},{"$f":"SUMIFS('TRADE LOG'!$T$15:$T$9733,closeDate,\">\"&CALENDAR!I149,closeDate,\"<=\"&C152,SIZE,\">0\")","v":0}]
[null,null,{"$f":"COUNTIFS(closeDate,\">\"&CALENDAR!C149,closeDate,\"<=\"&D149,SIZE,\">0\")","v":0},{"$f":"COUNTIFS(closeDate,\">\"&CALENDAR!D149,closeDate,\"<=\"&E149,SIZE,\">0\")","v":0},{"$f":"COUNTIFS(closeDate,\">\"&CALENDAR!E149,closeDate,\"<=\"&F149,SIZE,\">0\")","v":0},{"$f":"COUNTIFS(closeDate,\">\"&CALENDAR!F149,closeDate,\"<=\"&G149,SIZE,\">0\")","v":0},{"$f":"COUNTIFS(closeDate,\">\"&CALENDAR!G149,closeDate,\"<=\"&H149,SIZE,\">0\")","v":0},{"$f":"COUNTIFS(closeDate,\">\"&CALENDAR!H149,closeDate,\"<=\"&I149,SIZE,\">0\")","v":0},{"$f":"COUNTIFS(closeDate,\">\"&CALENDAR!I149,closeDate,\"<=\"&(I149+1),SIZE,\">0\")","v":0}]
[]
[null,null,{"$f":"EOMONTH(C132,0)+1","v":"2020-12-01"}]
[null,null,"SUN","MON","TUE","WED","THU","FRI","SAT"]
[null,null,{"$f":"IF(MONTH(C153)<>MONTH((C153-WEEKDAY(C153,1)+1)),\"\",(C153-WEEKDAY(C153,1)+1))","v":""},{"$f":"IF(MONTH(C153)<>MONTH((C153-WEEKDAY(C153,1)+2)),\"\",(C153-WEEKDAY(C153,1)+2))","v":""},{"$f":"IF(MONTH(C153)<>MONTH((C153-WEEKDAY(C153,1)+3)),\"\",(C153-WEEKDAY(C153,1)+3))","v":"2020-12-01"},{"$f":"IF(MONTH(C153)<>MONTH((C153-WEEKDAY(C153,1)+4)),\"\",(C153-WEEKDAY(C153,1)+4))","v":"2020-12-02"},{"$f":"IF(MONTH(C153)<>MONTH((C153-WEEKDAY(C153,1)+5)),\"\",(C153-WEEKDAY(C153,1)+5))","v":"2020-12-03"},{"$f":"IF(MONTH(C153)<>MONTH((C153-WEEKDAY(C153,1)+6)),\"\",(C153-WEEKDAY(C153,1)+6))","v":"2020-12-04"},{"$f":"IF(MONTH(C153)<>MONTH((C153-WEEKDAY(C153,1)+7)),\"\",(C153-WEEKDAY(C153,1)+7))","v":"2020-12-05"}]
[null,null,{"$f":"SUMIFS('TRADE LOG'!$T$15:$T$9733,closeDate,\">\"&CALENDAR!C155,closeDate,\"<=\"&D155,SIZE,\">0\")","v":0},{"$f":"SUMIFS('TRADE LOG'!$T$15:$T$9733,closeDate,\">\"&CALENDAR!D155,closeDate,\"<=\"&E155,SIZE,\">0\")","v":0},{"$f":"SUMIFS('TRADE LOG'!$T$15:$T$9733,closeDate,\">\"&CALENDAR!E155,closeDate,\"<=\"&F155,SIZE,\">0\")","v":0},{"$f":"SUMIFS('TRADE LOG'!$T$15:$T$9733,closeDate,\">\"&CALENDAR!F155,closeDate,\"<=\"&G155,SIZE,\">0\")","v":0},{"$f":"SUMIFS('TRADE LOG'!$T$15:$T$9733,closeDate,\">\"&CALENDAR!G155,closeDate,\"<=\"&H155,SIZE,\">0\")","v":0},{"$f":"SUMIFS('TRADE LOG'!$T$15:$T$9733,closeDate,\">\"&CALENDAR!H155,closeDate,\"<=\"&I155,SIZE,\">0\")","v":0},{"$f":"SUMIFS('TRADE LOG'!$T$15:$T$9733,closeDate,\">\"&CALENDAR!I155,closeDate,\"<=\"&C158,SIZE,\">0\")","v":0}]
[null,null,{"$f":"COUNTIFS(closeDate,\">\"&CALENDAR!C155,closeDate,\"<=\"&D155,SIZE,\">0\")","v":0},{"$f":"COUNTIFS(closeDate,\">\"&CALENDAR!D155,closeDate,\"<=\"&E155,SIZE,\">0\")","v":0},{"$f":"COUNTIFS(closeDate,\">\"&CALENDAR!E155,closeDate,\"<=\"&F155,SIZE,\">0\")","v":0},{"$f":"COUNTIFS(closeDate,\">\"&CALENDAR!F155,closeDate,\"<=\"&G155,SIZE,\">0\")","v":0},{"$f":"COUNTIFS(closeDate,\">\"&CALENDAR!G155,closeDate,\"<=\"&H155,SIZE,\">0\")","v":0},{"$f":"COUNTIFS(closeDate,\">\"&CALENDAR!H155,closeDate,\"<=\"&I155,SIZE,\">0\")","v":0},{"$f":"COUNTIFS(closeDate,\">\"&CALENDAR!I155,closeDate,\"<=\"&(I155+1),SIZE,\">0\")","v":0}]
[null,null,{"$f":"I155+1","v":"2020-12-06"},{"$f":"C158+1","v":"2020-12-07"},{"$f":"D158+1","v":"2020-12-08"},"2020-12-09","2020-12-10","2020-12-11","2020-12-12"]
[null,null,{"$f":"SUMIFS('TRADE LOG'!$T$15:$T$9733,closeDate,\">\"&CALENDAR!C158,closeDate,\"<=\"&D158,SIZE,\">0\")","v":0},{"$f":"SUMIFS('TRADE LOG'!$T$15:$T$9733,closeDate,\">\"&CALENDAR!D158,closeDate,\"<=\"&E158,SIZE,\">0\")","v":0},{"$f":"SUMIFS('TRADE LOG'!$T$15:$T$9733,closeDate,\">\"&CALENDAR!E158,closeDate,\"<=\"&F158,SIZE,\">0\")","v":0},{"$f":"SUMIFS('TRADE LOG'!$T$15:$T$9733,closeDate,\">\"&CALENDAR!F158,closeDate,\"<=\"&G158,SIZE,\">0\")","v":0},{"$f":"SUMIFS('TRADE LOG'!$T$15:$T$9733,closeDate,\">\"&CALENDAR!G158,closeDate,\"<=\"&H158,SIZE,\">0\")","v":0},{"$f":"SUMIFS('TRADE LOG'!$T$15:$T$9733,closeDate,\">\"&CALENDAR!H158,closeDate,\"<=\"&I158,SIZE,\">0\")","v":0},{"$f":"SUMIFS('TRADE LOG'!$T$15:$T$9733,closeDate,\">\"&CALENDAR!I158,closeDate,\"<=\"&C161,SIZE,\">0\")","v":0}]
[null,null,{"$f":"COUNTIFS(closeDate,\">\"&CALENDAR!C158,closeDate,\"<=\"&D158,SIZE,\">0\")","v":0},{"$f":"COUNTIFS(closeDate,\">\"&CALENDAR!D158,closeDate,\"<=\"&E158,SIZE,\">0\")","v":0},{"$f":"COUNTIFS(closeDate,\">\"&CALENDAR!E158,closeDate,\"<=\"&F158,SIZE,\">0\")","v":0},{"$f":"COUNTIFS(closeDate,\">\"&CALENDAR!F158,closeDate,\"<=\"&G158,SIZE,\">0\")","v":0},{"$f":"COUNTIFS(closeDate,\">\"&CALENDAR!G158,closeDate,\"<=\"&H158,SIZE,\">0\")","v":0},{"$f":"COUNTIFS(closeDate,\">\"&CALENDAR!H158,closeDate,\"<=\"&I158,SIZE,\">0\")","v":0},{"$f":"COUNTIFS(closeDate,\">\"&CALENDAR!I158,closeDate,\"<=\"&(I158+1),SIZE,\">0\")","v":0}]
[null,null,{"$f":"I158+1","v":"2020-12-13"},{"$f":"C161+1","v":"2020-12-14"},{"$f":"D161+1","v":"2020-12-15"},"2020-12-16","2020-12-17","2020-12-18","2020-12-19"]
[null,null,{"$f":"SUMIFS('TRADE LOG'!$T$15:$T$9733,closeDate,\">\"&CALENDAR!C161,closeDate,\"<=\"&D161,SIZE,\">0\")","v":0},{"$f":"SUMIFS('TRADE LOG'!$T$15:$T$9733,closeDate,\">\"&CALENDAR!D161,closeDate,\"<=\"&E161,SIZE,\">0\")","v":0},{"$f":"SUMIFS('TRADE LOG'!$T$15:$T$9733,closeDate,\">\"&CALENDAR!E161,closeDate,\"<=\"&F161,SIZE,\">0\")","v":0},{"$f":"SUMIFS('TRADE LOG'!$T$15:$T$9733,closeDate,\">\"&CALENDAR!F161,closeDate,\"<=\"&G161,SIZE,\">0\")","v":0},{"$f":"SUMIFS('TRADE LOG'!$T$15:$T$9733,closeDate,\">\"&CALENDAR!G161,closeDate,\"<=\"&H161,SIZE,\">0\")","v":0},{"$f":"SUMIFS('TRADE LOG'!$T$15:$T$9733,closeDate,\">\"&CALENDAR!H161,closeDate,\"<=\"&I161,SIZE,\">0\")","v":0},{"$f":"SUMIFS('TRADE LOG'!$T$15:$T$9733,closeDate,\">\"&CALENDAR!I161,closeDate,\"<=\"&C164,SIZE,\">0\")","v":0}]
[null,null,{"$f":"COUNTIFS(closeDate,\">\"&CALENDAR!C161,closeDate,\"<=\"&D161,SIZE,\">0\")","v":0},{"$f":"COUNTIFS(closeDate,\">\"&CALENDAR!D161,closeDate,\"<=\"&E161,SIZE,\">0\")","v":0},{"$f":"COUNTIFS(closeDate,\">\"&CALENDAR!E161,closeDate,\"<=\"&F161,SIZE,\">0\")","v":0},{"$f":"COUNTIFS(closeDate,\">\"&CALENDAR!F161,closeDate,\"<=\"&G161,SIZE,\">0\")","v":0},{"$f":"COUNTIFS(closeDate,\">\"&CALENDAR!G161,closeDate,\"<=\"&H161,SIZE,\">0\")","v":0},{"$f":"COUNTIFS(closeDate,\">\"&CALENDAR!H161,closeDate,\"<=\"&I161,SIZE,\">0\")","v":0},{"$f":"COUNTIFS(closeDate,\">\"&CALENDAR!I161,closeDate,\"<=\"&(I161+1),SIZE,\">0\")","v":0}]
[null,null,{"$f":"I161+1","v":"2020-12-20"},{"$f":"C164+1","v":"2020-12-21"},{"$f":"D164+1","v":"2020-12-22"},"2020-12-23","2020-12-24","2020-12-25","2020-12-26"]
[null,null,{"$f":"SUMIFS('TRADE LOG'!$T$15:$T$9733,closeDate,\">\"&CALENDAR!C164,closeDate,\"<=\"&D164,SIZE,\">0\")","v":0},{"$f":"SUMIFS('TRADE LOG'!$T$15:$T$9733,closeDate,\">\"&CALENDAR!D164,closeDate,\"<=\"&E164,SIZE,\">0\")","v":0},{"$f":"SUMIFS('TRADE LOG'!$T$15:$T$9733,closeDate,\">\"&CALENDAR!E164,closeDate,\"<=\"&F164,SIZE,\">0\")","v":0},{"$f":"SUMIFS('TRADE LOG'!$T$15:$T$9733,closeDate,\">\"&CALENDAR!F164,closeDate,\"<=\"&G164,SIZE,\">0\")","v":0},{"$f":"SUMIFS('TRADE LOG'!$T$15:$T$9733,closeDate,\">\"&CALENDAR!G164,closeDate,\"<=\"&H164,SIZE,\">0\")","v":0},{"$f":"SUMIFS('TRADE LOG'!$T$15:$T$9733,closeDate,\">\"&CALENDAR!H164,closeDate,\"<=\"&I164,SIZE,\">0\")","v":0},{"$f":"SUMIFS('TRADE LOG'!$T$15:$T$9733,closeDate,\">\"&CALENDAR!I164,closeDate,\"<=\"&C167,SIZE,\">0\")","v":0}]
[null,null,{"$f":"COUNTIFS(closeDate,\">\"&CALENDAR!C164,closeDate,\"<=\"&D164,SIZE,\">0\")","v":0},{"$f":"COUNTIFS(closeDate,\">\"&CALENDAR!D164,closeDate,\"<=\"&E164,SIZE,\">0\")","v":0},{"$f":"COUNTIFS(closeDate,\">\"&CALENDAR!E164,closeDate,\"<=\"&F164,SIZE,\">0\")","v":0},{"$f":"COUNTIFS(closeDate,\">\"&CALENDAR!F164,closeDate,\"<=\"&G164,SIZE,\">0\")","v":0},{"$f":"COUNTIFS(closeDate,\">\"&CALENDAR!G164,closeDate,\"<=\"&H164,SIZE,\">0\")","v":0},{"$f":"COUNTIFS(closeDate,\">\"&CALENDAR!H164,closeDate,\"<=\"&I164,SIZE,\">0\")","v":0},{"$f":"COUNTIFS(closeDate,\">\"&CALENDAR!I164,closeDate,\"<=\"&(I164+1),SIZE,\">0\")","v":0}]
[null,null,{"$f":"IFERROR(IF(MONTH(C153)<>MONTH(I164+1),\"\",(I164+1)),\"\")","v":"2020-12-27"},{"$f":"IFERROR(IF(MONTH(C153)<>MONTH(C167+1),\"\",(C167+1)),\"\")","v":"2020-12-28"},{"$f":"IFERROR(IF(MONTH(C153)<>MONTH(D167+1),\"\",(D167+1)),\"\")","v":"2020-12-29"},{"$f":"IFERROR(IF(MONTH(C153)<>MONTH(E167+1),\"\",(E167+1)),\"\")","v":"2020-12-30"},{"$f":"IFERROR(IF(MONTH(C153)<>MONTH(F167+1),\"\",(F167+1)),\"\")","v":"2020-12-31"},{"$f":"IFERROR(IF(MONTH(C153)<>MONTH(G167+1),\"\",(G167+1)),\"\")","v":""},{"$f":"IFERROR(IF(MONTH(C153)<>MONTH(H167+1),\"\",(H167+1)),\"\")","v":""}]
[null,null,{"$f":"SUMIFS('TRADE LOG'!$T$15:$T$9733,closeDate,\">\"&CALENDAR!C167,closeDate,\"<=\"&D167,SIZE,\">0\")","v":0},{"$f":"SUMIFS('TRADE LOG'!$T$15:$T$9733,closeDate,\">\"&CALENDAR!D167,closeDate,\"<=\"&E167,SIZE,\">0\")","v":0},{"$f":"SUMIFS('TRADE LOG'!$T$15:$T$9733,closeDate,\">\"&CALENDAR!E167,closeDate,\"<=\"&F167,SIZE,\">0\")","v":0},{"$f":"SUMIFS('TRADE LOG'!$T$15:$T$9733,closeDate,\">\"&CALENDAR!F167,closeDate,\"<=\"&G167,SIZE,\">0\")","v":0},{"$f":"SUMIFS('TRADE LOG'!$T$15:$T$9733,closeDate,\">\"&CALENDAR!G167,closeDate,\"<=\"&H167,SIZE,\">0\")","v":0},{"$f":"SUMIFS('TRADE LOG'!$T$15:$T$9733,closeDate,\">\"&CALENDAR!H167,closeDate,\"<=\"&I167,SIZE,\">0\")","v":0},{"$f":"SUMIFS('TRADE LOG'!$T$15:$T$9733,closeDate,\">\"&CALENDAR!I167,closeDate,\"<=\"&C170,SIZE,\">0\")","v":0}]
[null,null,{"$f":"COUNTIFS(closeDate,\">\"&CALENDAR!C167,closeDate,\"<=\"&D167,SIZE,\">0\")","v":0},{"$f":"COUNTIFS(closeDate,\">\"&CALENDAR!D167,closeDate,\"<=\"&E167,SIZE,\">0\")","v":0},{"$f":"COUNTIFS(closeDate,\">\"&CALENDAR!E167,closeDate,\"<=\"&F167,SIZE,\">0\")","v":0},{"$f":"COUNTIFS(closeDate,\">\"&CALENDAR!F167,closeDate,\"<=\"&G167,SIZE,\">0\")","v":0},{"$f":"COUNTIFS(closeDate,\">\"&CALENDAR!G167,closeDate,\"<=\"&H167,SIZE,\">0\")","v":0},{"$f":"COUNTIFS(closeDate,\">\"&CALENDAR!H167,closeDate,\"<=\"&I167,SIZE,\">0\")","v":0},{"$f":"COUNTIFS(closeDate,\">\"&CALENDAR!I167,closeDate,\"<=\"&(I167+1),SIZE,\">0\")","v":0}]
[null,null,{"$f":"IFERROR(IF(MONTH(C153)<>MONTH(I167+1),\"\",(I167+1)),\"\")","v":""},{"$f":"IFERROR(IF(MONTH(C153)<>MONTH(C170+1),\"\",(C170+1)),\"\")","v":""},{"$f":"IFERROR(IF(MONTH(C153)<>MONTH(D170+1),\"\",(D170+1)),\"\")","v":""},{"$f":"IFERROR(IF(MONTH(C153)<>MONTH(E170+1),\"\",(E170+1)),\"\")","v":""},{"$f":"IFERROR(IF(MONTH(C153)<>MONTH(F170+1),\"\",(F170+1)),\"\")","v":""},{"$f":"IFERROR(IF(MONTH(C153)<>MONTH(G170+1),\"\",(G170+1)),\"\")","v":""},{"$f":"IFERROR(IF(MONTH(C153)<>MONTH(H170+1),\"\",(H170+1)),\"\")","v":""}]
[null,null,{"$f":"SUMIFS('TRADE LOG'!$T$15:$T$9733,closeDate,\">\"&CALENDAR!C170,closeDate,\"<=\"&D170,SIZE,\">0\")","v":0},{"$f":"SUMIFS('TRADE LOG'!$T$15:$T$9733,closeDate,\">\"&CALENDAR!D170,closeDate,\"<=\"&E170,SIZE,\">0\")","v":0},{"$f":"SUMIFS('TRADE LOG'!$T$15:$T$9733,closeDate,\">\"&CALENDAR!E170,closeDate,\"<=\"&F170,SIZE,\">0\")","v":0},{"$f":"SUMIFS('TRADE LOG'!$T$15:$T$9733,closeDate,\">\"&CALENDAR!F170,closeDate,\"<=\"&G170,SIZE,\">0\")","v":0},{"$f":"SUMIFS('TRADE LOG'!$T$15:$T$9733,closeDate,\">\"&CALENDAR!G170,closeDate,\"<=\"&H170,SIZE,\">0\")","v":0},{"$f":"SUMIFS('TRADE LOG'!$T$15:$T$9733,closeDate,\">\"&CALENDAR!H170,closeDate,\"<=\"&I170,SIZE,\">0\")","v":0},{"$f":"SUMIFS('TRADE LOG'!$T$15:$T$9733,closeDate,\">\"&CALENDAR!I170,closeDate,\"<=\"&C173,SIZE,\">0\")","v":0}]
[null,null,{"$f":"COUNTIFS(closeDate,\">\"&CALENDAR!C170,closeDate,\"<=\"&D170,SIZE,\">0\")","v":0},{"$f":"COUNTIFS(closeDate,\">\"&CALENDAR!D170,closeDate,\"<=\"&E170,SIZE,\">0\")","v":0},{"$f":"COUNTIFS(closeDate,\">\"&CALENDAR!E170,closeDate,\"<=\"&F170,SIZE,\">0\")","v":0},{"$f":"COUNTIFS(closeDate,\">\"&CALENDAR!F170,closeDate,\"<=\"&G170,SIZE,\">0\")","v":0},{"$f":"COUNTIFS(closeDate,\">\"&CALENDAR!G170,closeDate,\"<=\"&H170,SIZE,\">0\")","v":0},{"$f":"COUNTIFS(closeDate,\">\"&CALENDAR!H170,closeDate,\"<=\"&I170,SIZE,\">0\")","v":0},{"$f":"COUNTIFS(closeDate,\">\"&CALENDAR!I170,closeDate,\"<=\"&(I170+1),SIZE,\">0\")","v":0}]
[]
[null,null,{"$f":"EOMONTH(C153,0)+1","v":"2021-01-01"}]
[null,null,"SUN","MON","TUE","WED","THU","FRI","SAT"]
[null,null,{"$f":"IF(MONTH(C174)<>MONTH((C174-WEEKDAY(C174,1)+1)),\"\",(C174-WEEKDAY(C174,1)+1))","v":""},{"$f":"IF(MONTH(C174)<>MONTH((C174-WEEKDAY(C174,1)+2)),\"\",(C174-WEEKDAY(C174,1)+2))","v":""},{"$f":"IF(MONTH(C174)<>MONTH((C174-WEEKDAY(C174,1)+3)),\"\",(C174-WEEKDAY(C174,1)+3))","v":""},{"$f":"IF(MONTH(C174)<>MONTH((C174-WEEKDAY(C174,1)+4)),\"\",(C174-WEEKDAY(C174,1)+4))","v":""},{"$f":"IF(MONTH(C174)<>MONTH((C174-WEEKDAY(C174,1)+5)),\"\",(C174-WEEKDAY(C174,1)+5))","v":""},{"$f":"IF(MONTH(C174)<>MONTH((C174-WEEKDAY(C174,1)+6)),\"\",(C174-WEEKDAY(C174,1)+6))","v":"2021-01-01"},{"$f":"IF(MONTH(C174)<>MONTH((C174-WEEKDAY(C174,1)+7)),\"\",(C174-WEEKDAY(C174,1)+7))","v":"2021-01-02"}]
[null,null,{"$f":"SUMIFS('TRADE LOG'!$T$15:$T$9733,closeDate,\">\"&CALENDAR!C176,closeDate,\"<=\"&D176,SIZE,\">0\")","v":0},{"$f":"SUMIFS('TRADE LOG'!$T$15:$T$9733,closeDate,\">\"&CALENDAR!D176,closeDate,\"<=\"&E176,SIZE,\">0\")","v":0},{"$f":"SUMIFS('TRADE LOG'!$T$15:$T$9733,closeDate,\">\"&CALENDAR!E176,closeDate,\"<=\"&F176,SIZE,\">0\")","v":0},{"$f":"SUMIFS('TRADE LOG'!$T$15:$T$9733,closeDate,\">\"&CALENDAR!F176,closeDate,\"<=\"&G176,SIZE,\">0\")","v":0},{"$f":"SUMIFS('TRADE LOG'!$T$15:$T$9733,closeDate,\">\"&CALENDAR!G176,closeDate,\"<=\"&H176,SIZE,\">0\")","v":0},{"$f":"SUMIFS('TRADE LOG'!$T$15:$T$9733,closeDate,\">\"&CALENDAR!H176,closeDate,\"<=\"&I176,SIZE,\">0\")","v":0},{"$f":"SUMIFS('TRADE LOG'!$T$15:$T$9733,closeDate,\">\"&CALENDAR!I176,closeDate,\"<=\"&C179,SIZE,\">0\")","v":0}]
[null,null,{"$f":"COUNTIFS(closeDate,\">\"&CALENDAR!C176,closeDate,\"<=\"&D176,SIZE,\">0\")","v":0},{"$f":"COUNTIFS(closeDate,\">\"&CALENDAR!D176,closeDate,\"<=\"&E176,SIZE,\">0\")","v":0},{"$f":"COUNTIFS(closeDate,\">\"&CALENDAR!E176,closeDate,\"<=\"&F176,SIZE,\">0\")","v":0},{"$f":"COUNTIFS(closeDate,\">\"&CALENDAR!F176,closeDate,\"<=\"&G176,SIZE,\">0\")","v":0},{"$f":"COUNTIFS(closeDate,\">\"&CALENDAR!G176,closeDate,\"<=\"&H176,SIZE,\">0\")","v":0},{"$f":"COUNTIFS(closeDate,\">\"&CALENDAR!H176,closeDate,\"<=\"&I176,SIZE,\">0\")","v":0},{"$f":"COUNTIFS(closeDate,\">\"&CALENDAR!I176,closeDate,\"<=\"&(I176+1),SIZE,\">0\")","v":0}]
[null,null,{"$f":"I176+1","v":"2021-01-03"},{"$f":"C179+1","v":"2021-01-04"},{"$f":"D179+1","v":"2021-01-05"},"2021-01-06","2021-01-07","2021-01-08","2021-01-09"]
[null,null,{"$f":"SUMIFS('TRADE LOG'!$T$15:$T$9733,closeDate,\">\"&CALENDAR!C179,closeDate,\"<=\"&D179,SIZE,\">0\")","v":0},{"$f":"SUMIFS('TRADE LOG'!$T$15:$T$9733,closeDate,\">\"&CALENDAR!D179,closeDate,\"<=\"&E179,SIZE,\">0\")","v":0},{"$f":"SUMIFS('TRADE LOG'!$T$15:$T$9733,closeDate,\">\"&CALENDAR!E179,closeDate,\"<=\"&F179,SIZE,\">0\")","v":0},{"$f":"SUMIFS('TRADE LOG'!$T$15:$T$9733,closeDate,\">\"&CALENDAR!F179,closeDate,\"<=\"&G179,SIZE,\">0\")","v":0},{"$f":"SUMIFS('TRADE LOG'!$T$15:$T$9733,closeDate,\">\"&CALENDAR!G179,closeDate,\"<=\"&H179,SIZE,\">0\")","v":0},{"$f":"SUMIFS('TRADE LOG'!$T$15:$T$9733,closeDate,\">\"&CALENDAR!H179,closeDate,\"<=\"&I179,SIZE,\">0\")","v":0},{"$f":"SUMIFS('TRADE LOG'!$T$15:$T$9733,closeDate,\">\"&CALENDAR!I179,closeDate,\"<=\"&C182,SIZE,\">0\")","v":0}]
[null,null,{"$f":"COUNTIFS(closeDate,\">\"&CALENDAR!C179,closeDate,\"<=\"&D179,SIZE,\">0\")","v":0},{"$f":"COUNTIFS(closeDate,\">\"&CALENDAR!D179,closeDate,\"<=\"&E179,SIZE,\">0\")","v":0},{"$f":"COUNTIFS(closeDate,\">\"&CALENDAR!E179,closeDate,\"<=\"&F179,SIZE,\">0\")","v":0},{"$f":"COUNTIFS(closeDate,\">\"&CALENDAR!F179,closeDate,\"<=\"&G179,SIZE,\">0\")","v":0},{"$f":"COUNTIFS(closeDate,\">\"&CALENDAR!G179,closeDate,\"<=\"&H179,SIZE,\">0\")","v":0},{"$f":"COUNTIFS(closeDate,\">\"&CALENDAR!H179,closeDate,\"<=\"&I179,SIZE,\">0\")","v":0},{"$f":"COUNTIFS(closeDate,\">\"&CALENDAR!I179,closeDate,\"<=\"&(I179+1),SIZE,\">0\")","v":0}]
[null,null,{"$f":"I179+1","v":"2021-01-10"},{"$f":"C182+1","v":"2021-01-11"},{"$f":"D182+1","v":"2021-01-12"},"2021-01-13","2021-01-14","2021-01-15","2021-01-16"]
[null,null,{"$f":"SUMIFS('TRADE LOG'!$T$15:$T$9733,closeDate,\">\"&CALENDAR!C182,closeDate,\"<=\"&D182,SIZE,\">0\")","v":0},{"$f":"SUMIFS('TRADE LOG'!$T$15:$T$9733,closeDate,\">\"&CALENDAR!D182,closeDate,\"<=\"&E182,SIZE,\">0\")","v":0},{"$f":"SUMIFS('TRADE LOG'!$T$15:$T$9733,closeDate,\">\"&CALENDAR!E182,closeDate,\"<=\"&F182,SIZE,\">0\")","v":0},{"$f":"SUMIFS('TRADE LOG'!$T$15:$T$9733,closeDate,\">\"&CALENDAR!F182,closeDate,\"<=\"&G182,SIZE,\">0\")","v":0},{"$f":"SUMIFS('TRADE LOG'!$T$15:$T$9733,closeDate,\">\"&CALENDAR!G182,closeDate,\"<=\"&H182,SIZE,\">0\")","v":0},{"$f":"SUMIFS('TRADE LOG'!$T$15:$T$9733,closeDate,\">\"&CALENDAR!H182,closeDate,\"<=\"&I182,SIZE,\">0\")","v":0},{"$f":"SUMIFS('TRADE LOG'!$T$15:$T$9733,closeDate,\">\"&CALENDAR!I182,closeDate,\"<=\"&C185,SIZE,\">0\")","v":0}]
[null,null,{"$f":"COUNTIFS(closeDate,\">\"&CALENDAR!C182,closeDate,\"<=\"&D182,SIZE,\">0\")","v":0},{"$f":"COUNTIFS(closeDate,\">\"&CALENDAR!D182,closeDate,\"<=\"&E182,SIZE,\">0\")","v":0},{"$f":"COUNTIFS(closeDate,\">\"&CALENDAR!E182,closeDate,\"<=\"&F182,SIZE,\">0\")","v":0},{"$f":"COUNTIFS(closeDate,\">\"&CALENDAR!F182,closeDate,\"<=\"&G182,SIZE,\">0\")","v":0},{"$f":"COUNTIFS(closeDate,\">\"&CALENDAR!G182,closeDate,\"<=\"&H182,SIZE,\">0\")","v":0},{"$f":"COUNTIFS(closeDate,\">\"&CALENDAR!H182,closeDate,\"<=\"&I182,SIZE,\">0\")","v":0},{"$f":"COUNTIFS(closeDate,\">\"&CALENDAR!I182,closeDate,\"<=\"&(I182+1),SIZE,\">0\")","v":0}]
[null,null,{"$f":"I182+1","v":"2021-01-17"},{"$f":"C185+1","v":"2021-01-18"},{"$f":"D185+1","v":"2021-01-19"},"2021-01-20","2021-01-21","2021-01-22","2021-01-23"]
[null,null,{"$f":"SUMIFS('TRADE LOG'!$T$15:$T$9733,closeDate,\">\"&CALENDAR!C185,closeDate,\"<=\"&D185,SIZE,\">0\")","v":0},{"$f":"SUMIFS('TRADE LOG'!$T$15:$T$9733,closeDate,\">\"&CALENDAR!D185,closeDate,\"<=\"&E185,SIZE,\">0\")","v":0},{"$f":"SUMIFS('TRADE LOG'!$T$15:$T$9733,closeDate,\">\"&CALENDAR!E185,closeDate,\"<=\"&F185,SIZE,\">0\")","v":0},{"$f":"SUMIFS('TRADE LOG'!$T$15:$T$9733,closeDate,\">\"&CALENDAR!F185,closeDate,\"<=\"&G185,SIZE,\">0\")","v":0},{"$f":"SUMIFS('TRADE LOG'!$T$15:$T$9733,closeDate,\">\"&CALENDAR!G185,closeDate,\"<=\"&H185,SIZE,\">0\")","v":0},{"$f":"SUMIFS('TRADE LOG'!$T$15:$T$9733,closeDate,\">\"&CALENDAR!H185,closeDate,\"<=\"&I185,SIZE,\">0\")","v":0},{"$f":"SUMIFS('TRADE LOG'!$T$15:$T$9733,closeDate,\">\"&CALENDAR!I185,closeDate,\"<=\"&C188,SIZE,\">0\")","v":0}]
[null,null,{"$f":"COUNTIFS(closeDate,\">\"&CALENDAR!C185,closeDate,\"<=\"&D185,SIZE,\">0\")","v":0},{"$f":"COUNTIFS(closeDate,\">\"&CALENDAR!D185,closeDate,\"<=\"&E185,SIZE,\">0\")","v":0},{"$f":"COUNTIFS(closeDate,\">\"&CALENDAR!E185,closeDate,\"<=\"&F185,SIZE,\">0\")","v":0},{"$f":"COUNTIFS(closeDate,\">\"&CALENDAR!F185,closeDate,\"<=\"&G185,SIZE,\">0\")","v":0},{"$f":"COUNTIFS(closeDate,\">\"&CALENDAR!G185,closeDate,\"<=\"&H185,SIZE,\">0\")","v":0},{"$f":"COUNTIFS(closeDate,\">\"&CALENDAR!H185,closeDate,\"<=\"&I185,SIZE,\">0\")","v":0},{"$f":"COUNTIFS(closeDate,\">\"&CALENDAR!I185,closeDate,\"<=\"&(I185+1),SIZE,\">0\")","v":0}]
[null,null,{"$f":"IFERROR(IF(MONTH(C174)<>MONTH(I185+1),\"\",(I185+1)),\"\")","v":"2021-01-24"},{"$f":"IFERROR(IF(MONTH(C174)<>MONTH(C188+1),\"\",(C188+1)),\"\")","v":"2021-01-25"},{"$f":"IFERROR(IF(MONTH(C174)<>MONTH(D188+1),\"\",(D188+1)),\"\")","v":"2021-01-26"},{"$f":"IFERROR(IF(MONTH(C174)<>MONTH(E188+1),\"\",(E188+1)),\"\")","v":"2021-01-27"},{"$f":"IFERROR(IF(MONTH(C174)<>MONTH(F188+1),\"\",(F188+1)),\"\")","v":"2021-01-28"},{"$f":"IFERROR(IF(MONTH(C174)<>MONTH(G188+1),\"\",(G188+1)),\"\")","v":"2021-01-29"},{"$f":"IFERROR(IF(MONTH(C174)<>MONTH(H188+1),\"\",(H188+1)),\"\")","v":"2021-01-30"}]
[null,null,{"$f":"SUMIFS('TRADE LOG'!$T$15:$T$9733,closeDate,\">\"&CALENDAR!C188,closeDate,\"<=\"&D188,SIZE,\">0\")","v":0},{"$f":"SUMIFS('TRADE LOG'!$T$15:$T$9733,closeDate,\">\"&CALENDAR!D188,closeDate,\"<=\"&E188,SIZE,\">0\")","v":0},{"$f":"SUMIFS('TRADE LOG'!$T$15:$T$9733,closeDate,\">\"&CALENDAR!E188,closeDate,\"<=\"&F188,SIZE,\">0\")","v":0},{"$f":"SUMIFS('TRADE LOG'!$T$15:$T$9733,closeDate,\">\"&CALENDAR!F188,closeDate,\"<=\"&G188,SIZE,\">0\")","v":0},{"$f":"SUMIFS('TRADE LOG'!$T$15:$T$9733,closeDate,\">\"&CALENDAR!G188,closeDate,\"<=\"&H188,SIZE,\">0\")","v":0},{"$f":"SUMIFS('TRADE LOG'!$T$15:$T$9733,closeDate,\">\"&CALENDAR!H188,closeDate,\"<=\"&I188,SIZE,\">0\")","v":0},{"$f":"SUMIFS('TRADE LOG'!$T$15:$T$9733,closeDate,\">\"&CALENDAR!I188,closeDate,\"<=\"&C191,SIZE,\">0\")","v":0}]
[null,null,{"$f":"COUNTIFS(closeDate,\">\"&CALENDAR!C188,closeDate,\"<=\"&D188,SIZE,\">0\")","v":0},{"$f":"COUNTIFS(closeDate,\">\"&CALENDAR!D188,closeDate,\"<=\"&E188,SIZE,\">0\")","v":0},{"$f":"COUNTIFS(closeDate,\">\"&CALENDAR!E188,closeDate,\"<=\"&F188,SIZE,\">0\")","v":0},{"$f":"COUNTIFS(closeDate,\">\"&CALENDAR!F188,closeDate,\"<=\"&G188,SIZE,\">0\")","v":0},{"$f":"COUNTIFS(closeDate,\">\"&CALENDAR!G188,closeDate,\"<=\"&H188,SIZE,\">0\")","v":0},{"$f":"COUNTIFS(closeDate,\">\"&CALENDAR!H188,closeDate,\"<=\"&I188,SIZE,\">0\")","v":0},{"$f":"COUNTIFS(closeDate,\">\"&CALENDAR!I188,closeDate,\"<=\"&(I188+1),SIZE,\">0\")","v":0}]
[null,null,{"$f":"IFERROR(IF(MONTH(C174)<>MONTH(I188+1),\"\",(I188+1)),\"\")","v":"2021-01-31"},{"$f":"IFERROR(IF(MONTH(C174)<>MONTH(C191+1),\"\",(C191+1)),\"\")","v":""},{"$f":"IFERROR(IF(MONTH(C174)<>MONTH(D191+1),\"\",(D191+1)),\"\")","v":""},{"$f":"IFERROR(IF(MONTH(C174)<>MONTH(E191+1),\"\",(E191+1)),\"\")","v":""},{"$f":"IFERROR(IF(MONTH(C174)<>MONTH(F191+1),\"\",(F191+1)),\"\")","v":""},{"$f":"IFERROR(IF(MONTH(C174)<>MONTH(G191+1),\"\",(G191+1)),\"\")","v":""},{"$f":"IFERROR(IF(MONTH(C174)<>MONTH(H191+1),\"\",(H191+1)),\"\")","v":""}]
[null,null,{"$f":"SUMIFS('TRADE LOG'!$T$15:$T$9733,closeDate,\">\"&CALENDAR!C191,closeDate,\"<=\"&D191,SIZE,\">0\")","v":0},{"$f":"SUMIFS('TRADE LOG'!$T$15:$T$9733,closeDate,\">\"&CALENDAR!D191,closeDate,\"<=\"&E191,SIZE,\">0\")","v":0},{"$f":"SUMIFS('TRADE LOG'!$T$15:$T$9733,closeDate,\">\"&CALENDAR!E191,closeDate,\"<=\"&F191,SIZE,\">0\")","v":0},{"$f":"SUMIFS('TRADE LOG'!$T$15:$T$9733,closeDate,\">\"&CALENDAR!F191,closeDate,\"<=\"&G191,SIZE,\">0\")","v":0},{"$f":"SUMIFS('TRADE LOG'!$T$15:$T$9733,closeDate,\">\"&CALENDAR!G191,closeDate,\"<=\"&H191,SIZE,\">0\")","v":0},{"$f":"SUMIFS('TRADE LOG'!$T$15:$T$9733,closeDate,\">\"&CALENDAR!H191,closeDate,\"<=\"&I191,SIZE,\">0\")","v":0},{"$f":"SUMIFS('TRADE LOG'!$T$15:$T$9733,closeDate,\">\"&CALENDAR!I191,closeDate,\"<=\"&C194,SIZE,\">0\")","v":0}]
[null,null,{"$f":"COUNTIFS(closeDate,\">\"&CALENDAR!C191,closeDate,\"<=\"&D191,SIZE,\">0\")","v":0},{"$f":"COUNTIFS(closeDate,\">\"&CALENDAR!D191,closeDate,\"<=\"&E191,SIZE,\">0\")","v":0},{"$f":"COUNTIFS(closeDate,\">\"&CALENDAR!E191,closeDate,\"<=\"&F191,SIZE,\">0\")","v":0},{"$f":"COUNTIFS(closeDate,\">\"&CALENDAR!F191,closeDate,\"<=\"&G191,SIZE,\">0\")","v":0},{"$f":"COUNTIFS(closeDate,\">\"&CALENDAR!G191,closeDate,\"<=\"&H191,SIZE,\">0\")","v":0},{"$f":"COUNTIFS(closeDate,\">\"&CALENDAR!H191,closeDate,\"<=\"&I191,SIZE,\">0\")","v":0},{"$f":"COUNTIFS(closeDate,\">\"&CALENDAR!I191,closeDate,\"<=\"&(I191+1),SIZE,\">0\")","v":0}]
[]
[null,null,{"$f":"EOMONTH(C174,0)+1","v":"2021-02-01"}]
[null,null,"SUN","MON","TUE","WED","THU","FRI","SAT"]
[null,null,{"$f":"IF(MONTH(C195)<>MONTH((C195-WEEKDAY(C195,1)+1)),\"\",(C195-WEEKDAY(C195,1)+1))","v":""},{"$f":"IF(MONTH(C195)<>MONTH((C195-WEEKDAY(C195,1)+2)),\"\",(C195-WEEKDAY(C195,1)+2))","v":"2021-02-01"},{"$f":"IF(MONTH(C195)<>MONTH((C195-WEEKDAY(C195,1)+3)),\"\",(C195-WEEKDAY(C195,1)+3))","v":"2021-02-02"},{"$f":"IF(MONTH(C195)<>MONTH((C195-WEEKDAY(C195,1)+4)),\"\",(C195-WEEKDAY(C195,1)+4))","v":"2021-02-03"},{"$f":"IF(MONTH(C195)<>MONTH((C195-WEEKDAY(C195,1)+5)),\"\",(C195-WEEKDAY(C195,1)+5))","v":"2021-02-04"},{"$f":"IF(MONTH(C195)<>MONTH((C195-WEEKDAY(C195,1)+6)),\"\",(C195-WEEKDAY(C195,1)+6))","v":"2021-02-05"},{"$f":"IF(MONTH(C195)<>MONTH((C195-WEEKDAY(C195,1)+7)),\"\",(C195-WEEKDAY(C195,1)+7))","v":"2021-02-06"}]
[null,null,{"$f":"SUMIFS('TRADE LOG'!$T$15:$T$9733,closeDate,\">\"&CALENDAR!C197,closeDate,\"<=\"&D197,SIZE,\">0\")","v":0},{"$f":"SUMIFS('TRADE LOG'!$T$15:$T$9733,closeDate,\">\"&CALENDAR!D197,closeDate,\"<=\"&E197,SIZE,\">0\")","v":0},{"$f":"SUMIFS('TRADE LOG'!$T$15:$T$9733,closeDate,\">\"&CALENDAR!E197,closeDate,\"<=\"&F197,SIZE,\">0\")","v":0},{"$f":"SUMIFS('TRADE LOG'!$T$15:$T$9733,closeDate,\">\"&CALENDAR!F197,closeDate,\"<=\"&G197,SIZE,\">0\")","v":0},{"$f":"SUMIFS('TRADE LOG'!$T$15:$T$9733,closeDate,\">\"&CALENDAR!G197,closeDate,\"<=\"&H197,SIZE,\">0\")","v":0},{"$f":"SUMIFS('TRADE LOG'!$T$15:$T$9733,closeDate,\">\"&CALENDAR!H197,closeDate,\"<=\"&I197,SIZE,\">0\")","v":0},{"$f":"SUMIFS('TRADE LOG'!$T$15:$T$9733,closeDate,\">\"&CALENDAR!I197,closeDate,\"<=\"&C200,SIZE,\">0\")","v":0}]
[null,null,{"$f":"COUNTIFS(closeDate,\">\"&CALENDAR!C197,closeDate,\"<=\"&D197,SIZE,\">0\")","v":0},{"$f":"COUNTIFS(closeDate,\">\"&CALENDAR!D197,closeDate,\"<=\"&E197,SIZE,\">0\")","v":0},{"$f":"COUNTIFS(closeDate,\">\"&CALENDAR!E197,closeDate,\"<=\"&F197,SIZE,\">0\")","v":0},{"$f":"COUNTIFS(closeDate,\">\"&CALENDAR!F197,closeDate,\"<=\"&G197,SIZE,\">0\")","v":0},{"$f":"COUNTIFS(closeDate,\">\"&CALENDAR!G197,closeDate,\"<=\"&H197,SIZE,\">0\")","v":0},{"$f":"COUNTIFS(closeDate,\">\"&CALENDAR!H197,closeDate,\"<=\"&I197,SIZE,\">0\")","v":0},{"$f":"COUNTIFS(closeDate,\">\"&CALENDAR!I197,closeDate,\"<=\"&(I197+1),SIZE,\">0\")","v":0}]
[null,null,{"$f":"I197+1","v":"2021-02-07"},{"$f":"C200+1","v":"2021-02-08"},{"$f":"D200+1","v":"2021-02-09"},"2021-02-10","2021-02-11","2021-02-12","2021-02-13"]
[null,null,{"$f":"SUMIFS('TRADE LOG'!$T$15:$T$9733,closeDate,\">\"&CALENDAR!C200,closeDate,\"<=\"&D200,SIZE,\">0\")","v":0},{"$f":"SUMIFS('TRADE LOG'!$T$15:$T$9733,closeDate,\">\"&CALENDAR!D200,closeDate,\"<=\"&E200,SIZE,\">0\")","v":0},{"$f":"SUMIFS('TRADE LOG'!$T$15:$T$9733,closeDate,\">\"&CALENDAR!E200,closeDate,\"<=\"&F200,SIZE,\">0\")","v":0},{"$f":"SUMIFS('TRADE LOG'!$T$15:$T$9733,closeDate,\">\"&CALENDAR!F200,closeDate,\"<=\"&G200,SIZE,\">0\")","v":0},{"$f":"SUMIFS('TRADE LOG'!$T$15:$T$9733,closeDate,\">\"&CALENDAR!G200,closeDate,\"<=\"&H200,SIZE,\">0\")","v":0},{"$f":"SUMIFS('TRADE LOG'!$T$15:$T$9733,closeDate,\">\"&CALENDAR!H200,closeDate,\"<=\"&I200,SIZE,\">0\")","v":0},{"$f":"SUMIFS('TRADE LOG'!$T$15:$T$9733,closeDate,\">\"&CALENDAR!I200,closeDate,\"<=\"&C203,SIZE,\">0\")","v":0}]
[null,null,{"$f":"COUNTIFS(closeDate,\">\"&CALENDAR!C200,closeDate,\"<=\"&D200,SIZE,\">0\")","v":0},{"$f":"COUNTIFS(closeDate,\">\"&CALENDAR!D200,closeDate,\"<=\"&E200,SIZE,\">0\")","v":0},{"$f":"COUNTIFS(closeDate,\">\"&CALENDAR!E200,closeDate,\"<=\"&F200,SIZE,\">0\")","v":0},{"$f":"COUNTIFS(closeDate,\">\"&CALENDAR!F200,closeDate,\"<=\"&G200,SIZE,\">0\")","v":0},{"$f":"COUNTIFS(closeDate,\">\"&CALENDAR!G200,closeDate,\"<=\"&H200,SIZE,\">0\")","v":0},{"$f":"COUNTIFS(closeDate,\">\"&CALENDAR!H200,closeDate,\"<=\"&I200,SIZE,\">0\")","v":0},{"$f":"COUNTIFS(closeDate,\">\"&CALENDAR!I200,closeDate,\"<=\"&(I200+1),SIZE,\">0\")","v":0}]
[null,null,{"$f":"I200+1","v":"2021-02-14"},{"$f":"C203+1","v":"2021-02-15"},{"$f":"D203+1","v":"2021-02-16"},"2021-02-17","2021-02-18","2021-02-19","2021-02-20"]
[null,null,{"$f":"SUMIFS('TRADE LOG'!$T$15:$T$9733,closeDate,\">\"&CALENDAR!C203,closeDate,\"<=\"&D203,SIZE,\">0\")","v":0},{"$f":"SUMIFS('TRADE LOG'!$T$15:$T$9733,closeDate,\">\"&CALENDAR!D203,closeDate,\"<=\"&E203,SIZE,\">0\")","v":0},{"$f":"SUMIFS('TRADE LOG'!$T$15:$T$9733,closeDate,\">\"&CALENDAR!E203,closeDate,\"<=\"&F203,SIZE,\">0\")","v":0},{"$f":"SUMIFS('TRADE LOG'!$T$15:$T$9733,closeDate,\">\"&CALENDAR!F203,closeDate,\"<=\"&G203,SIZE,\">0\")","v":0},{"$f":"SUMIFS('TRADE LOG'!$T$15:$T$9733,closeDate,\">\"&CALENDAR!G203,closeDate,\"<=\"&H203,SIZE,\">0\")","v":0},{"$f":"SUMIFS('TRADE LOG'!$T$15:$T$9733,closeDate,\">\"&CALENDAR!H203,closeDate,\"<=\"&I203,SIZE,\">0\")","v":0},{"$f":"SUMIFS('TRADE LOG'!$T$15:$T$9733,closeDate,\">\"&CALENDAR!I203,closeDate,\"<=\"&C206,SIZE,\">0\")","v":0}]
[null,null,{"$f":"COUNTIFS(closeDate,\">\"&CALENDAR!C203,closeDate,\"<=\"&D203,SIZE,\">0\")","v":0},{"$f":"COUNTIFS(closeDate,\">\"&CALENDAR!D203,closeDate,\"<=\"&E203,SIZE,\">0\")","v":0},{"$f":"COUNTIFS(closeDate,\">\"&CALENDAR!E203,closeDate,\"<=\"&F203,SIZE,\">0\")","v":0},{"$f":"COUNTIFS(closeDate,\">\"&CALENDAR!F203,closeDate,\"<=\"&G203,SIZE,\">0\")","v":0},{"$f":"COUNTIFS(closeDate,\">\"&CALENDAR!G203,closeDate,\"<=\"&H203,SIZE,\">0\")","v":0},{"$f":"COUNTIFS(closeDate,\">\"&CALENDAR!H203,closeDate,\"<=\"&I203,SIZE,\">0\")","v":0},{"$f":"COUNTIFS(closeDate,\">\"&CALENDAR!I203,closeDate,\"<=\"&(I203+1),SIZE,\">0\")","v":0}]
[null,null,{"$f":"I203+1","v":"2021-02-21"},{"$f":"C206+1","v":"2021-02-22"},{"$f":"D206+1","v":"2021-02-23"},"2021-02-24","2021-02-25","2021-02-26","2021-02-27"]
[null,null,{"$f":"SUMIFS('TRADE LOG'!$T$15:$T$9733,closeDate,\">\"&CALENDAR!C206,closeDate,\"<=\"&D206,SIZE,\">0\")","v":0},{"$f":"SUMIFS('TRADE LOG'!$T$15:$T$9733,closeDate,\">\"&CALENDAR!D206,closeDate,\"<=\"&E206,SIZE,\">0\")","v":0},{"$f":"SUMIFS('TRADE LOG'!$T$15:$T$9733,closeDate,\">\"&CALENDAR!E206,closeDate,\"<=\"&F206,SIZE,\">0\")","v":0},{"$f":"SUMIFS('TRADE LOG'!$T$15:$T$9733,closeDate,\">\"&CALENDAR!F206,closeDate,\"<=\"&G206,SIZE,\">0\")","v":0},{"$f":"SUMIFS('TRADE LOG'!$T$15:$T$9733,closeDate,\">\"&CALENDAR!G206,closeDate,\"<=\"&H206,SIZE,\">0\")","v":0},{"$f":"SUMIFS('TRADE LOG'!$T$15:$T$9733,closeDate,\">\"&CALENDAR!H206,closeDate,\"<=\"&I206,SIZE,\">0\")","v":0},{"$f":"SUMIFS('TRADE LOG'!$T$15:$T$9733,closeDate,\">\"&CALENDAR!I206,closeDate,\"<=\"&C209,SIZE,\">0\")","v":0}]
[null,null,{"$f":"COUNTIFS(closeDate,\">\"&CALENDAR!C206,closeDate,\"<=\"&D206,SIZE,\">0\")","v":0},{"$f":"COUNTIFS(closeDate,\">\"&CALENDAR!D206,closeDate,\"<=\"&E206,SIZE,\">0\")","v":0},{"$f":"COUNTIFS(closeDate,\">\"&CALENDAR!E206,closeDate,\"<=\"&F206,SIZE,\">0\")","v":0},{"$f":"COUNTIFS(closeDate,\">\"&CALENDAR!F206,closeDate,\"<=\"&G206,SIZE,\">0\")","v":0},{"$f":"COUNTIFS(closeDate,\">\"&CALENDAR!G206,closeDate,\"<=\"&H206,SIZE,\">0\")","v":0},{"$f":"COUNTIFS(closeDate,\">\"&CALENDAR!H206,closeDate,\"<=\"&I206,SIZE,\">0\")","v":0},{"$f":"COUNTIFS(closeDate,\">\"&CALENDAR!I206,closeDate,\"<=\"&(I206+1),SIZE,\">0\")","v":0}]
[null,null,{"$f":"IFERROR(IF(MONTH(C195)<>MONTH(I206+1),\"\",(I206+1)),\"\")","v":"2021-02-28"},{"$f":"IFERROR(IF(MONTH(C195)<>MONTH(C209+1),\"\",(C209+1)),\"\")","v":""},{"$f":"IFERROR(IF(MONTH(C195)<>MONTH(D209+1),\"\",(D209+1)),\"\")","v":""},{"$f":"IFERROR(IF(MONTH(C195)<>MONTH(E209+1),\"\",(E209+1)),\"\")","v":""},{"$f":"IFERROR(IF(MONTH(C195)<>MONTH(F209+1),\"\",(F209+1)),\"\")","v":""},{"$f":"IFERROR(IF(MONTH(C195)<>MONTH(G209+1),\"\",(G209+1)),\"\")","v":""},{"$f":"IFERROR(IF(MONTH(C195)<>MONTH(H209+1),\"\",(H209+1)),\"\")","v":""}]
[null,null,{"$f":"SUMIFS('TRADE LOG'!$T$15:$T$9733,closeDate,\">\"&CALENDAR!C209,closeDate,\"<=\"&D209,SIZE,\">0\")","v":0},{"$f":"SUMIFS('TRADE LOG'!$T$15:$T$9733,closeDate,\">\"&CALENDAR!D209,closeDate,\"<=\"&E209,SIZE,\">0\")","v":0},{"$f":"SUMIFS('TRADE LOG'!$T$15:$T$9733,closeDate,\">\"&CALENDAR!E209,closeDate,\"<=\"&F209,SIZE,\">0\")","v":0},{"$f":"SUMIFS('TRADE LOG'!$T$15:$T$9733,closeDate,\">\"&CALENDAR!F209,closeDate,\"<=\"&G209,SIZE,\">0\")","v":0},{"$f":"SUMIFS('TRADE LOG'!$T$15:$T$9733,closeDate,\">\"&CALENDAR!G209,closeDate,\"<=\"&H209,SIZE,\">0\")","v":0},{"$f":"SUMIFS('TRADE LOG'!$T$15:$T$9733,closeDate,\">\"&CALENDAR!H209,closeDate,\"<=\"&I209,SIZE,\">0\")","v":0},{"$f":"SUMIFS('TRADE LOG'!$T$15:$T$9733,closeDate,\">\"&CALENDAR!I209,closeDate,\"<=\"&C212,SIZE,\">0\")","v":0}]
[null,null,{"$f":"COUNTIFS(closeDate,\">\"&CALENDAR!C209,closeDate,\"<=\"&D209,SIZE,\">0\")","v":0},{"$f":"COUNTIFS(closeDate,\">\"&CALENDAR!D209,closeDate,\"<=\"&E209,SIZE,\">0\")","v":0},{"$f":"COUNTIFS(closeDate,\">\"&CALENDAR!E209,closeDate,\"<=\"&F209,SIZE,\">0\")","v":0},{"$f":"COUNTIFS(closeDate,\">\"&CALENDAR!F209,closeDate,\"<=\"&G209,SIZE,\">0\")","v":0},{"$f":"COUNTIFS(closeDate,\">\"&CALENDAR!G209,closeDate,\"<=\"&H209,SIZE,\">0\")","v":0},{"$f":"COUNTIFS(closeDate,\">\"&CALENDAR!H209,closeDate,\"<=\"&I209,SIZE,\">0\")","v":0},{"$f":"COUNTIFS(closeDate,\">\"&CALENDAR!I209,closeDate,\"<=\"&(I209+1),SIZE,\">0\")","v":0}]
[null,null,{"$f":"IFERROR(IF(MONTH(C195)<>MONTH(I209+1),\"\",(I209+1)),\"\")","v":""},{"$f":"IFERROR(IF(MONTH(C195)<>MONTH(C212+1),\"\",(C212+1)),\"\")","v":""},{"$f":"IFERROR(IF(MONTH(C195)<>MONTH(D212+1),\"\",(D212+1)),\"\")","v":""},{"$f":"IFERROR(IF(MONTH(C195)<>MONTH(E212+1),\"\",(E212+1)),\"\")","v":""},{"$f":"IFERROR(IF(MONTH(C195)<>MONTH(F212+1),\"\",(F212+1)),\"\")","v":""},{"$f":"IFERROR(IF(MONTH(C195)<>MONTH(G212+1),\"\",(G212+1)),\"\")","v":""},{"$f":"IFERROR(IF(MONTH(C195)<>MONTH(H212+1),\"\",(H212+1)),\"\")","v":""}]
[null,null,{"$f":"SUMIFS('TRADE LOG'!$T$15:$T$9733,closeDate,\">\"&CALENDAR!C212,closeDate,\"<=\"&D212,SIZE,\">0\")","v":0},{"$f":"SUMIFS('TRADE LOG'!$T$15:$T$9733,closeDate,\">\"&CALENDAR!D212,closeDate,\"<=\"&E212,SIZE,\">0\")","v":0},{"$f":"SUMIFS('TRADE LOG'!$T$15:$T$9733,closeDate,\">\"&CALENDAR!E212,closeDate,\"<=\"&F212,SIZE,\">0\")","v":0},{"$f":"SUMIFS('TRADE LOG'!$T$15:$T$9733,closeDate,\">\"&CALENDAR!F212,closeDate,\"<=\"&G212,SIZE,\">0\")","v":0},{"$f":"SUMIFS('TRADE LOG'!$T$15:$T$9733,closeDate,\">\"&CALENDAR!G212,closeDate,\"<=\"&H212,SIZE,\">0\")","v":0},{"$f":"SUMIFS('TRADE LOG'!$T$15:$T$9733,closeDate,\">\"&CALENDAR!H212,closeDate,\"<=\"&I212,SIZE,\">0\")","v":0},{"$f":"SUMIFS('TRADE LOG'!$T$15:$T$9733,closeDate,\">\"&CALENDAR!I212,closeDate,\"<=\"&C215,SIZE,\">0\")","v":0}]
[null,null,{"$f":"COUNTIFS(closeDate,\">\"&CALENDAR!C212,closeDate,\"<=\"&D212,SIZE,\">0\")","v":0},{"$f":"COUNTIFS(closeDate,\">\"&CALENDAR!D212,closeDate,\"<=\"&E212,SIZE,\">0\")","v":0},{"$f":"COUNTIFS(closeDate,\">\"&CALENDAR!E212,closeDate,\"<=\"&F212,SIZE,\">0\")","v":0},{"$f":"COUNTIFS(closeDate,\">\"&CALENDAR!F212,closeDate,\"<=\"&G212,SIZE,\">0\")","v":0},{"$f":"COUNTIFS(closeDate,\">\"&CALENDAR!G212,closeDate,\"<=\"&H212,SIZE,\">0\")","v":0},{"$f":"COUNTIFS(closeDate,\">\"&CALENDAR!H212,closeDate,\"<=\"&I212,SIZE,\">0\")","v":0},{"$f":"COUNTIFS(closeDate,\">\"&CALENDAR!I212,closeDate,\"<=\"&(I212+1),SIZE,\">0\")","v":0}]
[]
[null,null,{"$f":"EOMONTH(C195,0)+1","v":"2021-03-01"}]
[null,null,"SUN","MON","TUE","WED","THU","FRI","SAT"]
[null,null,{"$f":"IF(MONTH(C216)<>MONTH((C216-WEEKDAY(C216,1)+1)),\"\",(C216-WEEKDAY(C216,1)+1))","v":""},{"$f":"IF(MONTH(C216)<>MONTH((C216-WEEKDAY(C216,1)+2)),\"\",(C216-WEEKDAY(C216,1)+2))","v":"2021-03-01"},{"$f":"IF(MONTH(C216)<>MONTH((C216-WEEKDAY(C216,1)+3)),\"\",(C216-WEEKDAY(C216,1)+3))","v":"2021-03-02"},{"$f":"IF(MONTH(C216)<>MONTH((C216-WEEKDAY(C216,1)+4)),\"\",(C216-WEEKDAY(C216,1)+4))","v":"2021-03-03"},{"$f":"IF(MONTH(C216)<>MONTH((C216-WEEKDAY(C216,1)+5)),\"\",(C216-WEEKDAY(C216,1)+5))","v":"2021-03-04"},{"$f":"IF(MONTH(C216)<>MONTH((C216-WEEKDAY(C216,1)+6)),\"\",(C216-WEEKDAY(C216,1)+6))","v":"2021-03-05"},{"$f":"IF(MONTH(C216)<>MONTH((C216-WEEKDAY(C216,1)+7)),\"\",(C216-WEEKDAY(C216,1)+7))","v":"2021-03-06"}]
[null,null,{"$f":"SUMIFS('TRADE LOG'!$T$15:$T$9733,closeDate,\">\"&CALENDAR!C218,closeDate,\"<=\"&D218,SIZE,\">0\")","v":0},{"$f":"SUMIFS('TRADE LOG'!$T$15:$T$9733,closeDate,\">\"&CALENDAR!D218,closeDate,\"<=\"&E218,SIZE,\">0\")","v":0},{"$f":"SUMIFS('TRADE LOG'!$T$15:$T$9733,closeDate,\">\"&CALENDAR!E218,closeDate,\"<=\"&F218,SIZE,\">0\")","v":0},{"$f":"SUMIFS('TRADE LOG'!$T$15:$T$9733,closeDate,\">\"&CALENDAR!F218,closeDate,\"<=\"&G218,SIZE,\">0\")","v":0},{"$f":"SUMIFS('TRADE LOG'!$T$15:$T$9733,closeDate,\">\"&CALENDAR!G218,closeDate,\"<=\"&H218,SIZE,\">0\")","v":0},{"$f":"SUMIFS('TRADE LOG'!$T$15:$T$9733,closeDate,\">\"&CALENDAR!H218,closeDate,\"<=\"&I218,SIZE,\">0\")","v":0},{"$f":"SUMIFS('TRADE LOG'!$T$15:$T$9733,closeDate,\">\"&CALENDAR!I218,closeDate,\"<=\"&C221,SIZE,\">0\")","v":0}]
[null,null,{"$f":"COUNTIFS(closeDate,\">\"&CALENDAR!C218,closeDate,\"<=\"&D218,SIZE,\">0\")","v":0},{"$f":"COUNTIFS(closeDate,\">\"&CALENDAR!D218,closeDate,\"<=\"&E218,SIZE,\">0\")","v":0},{"$f":"COUNTIFS(closeDate,\">\"&CALENDAR!E218,closeDate,\"<=\"&F218,SIZE,\">0\")","v":0},{"$f":"COUNTIFS(closeDate,\">\"&CALENDAR!F218,closeDate,\"<=\"&G218,SIZE,\">0\")","v":0},{"$f":"COUNTIFS(closeDate,\">\"&CALENDAR!G218,closeDate,\"<=\"&H218,SIZE,\">0\")","v":0},{"$f":"COUNTIFS(closeDate,\">\"&CALENDAR!H218,closeDate,\"<=\"&I218,SIZE,\">0\")","v":0},{"$f":"COUNTIFS(closeDate,\">\"&CALENDAR!I218,closeDate,\"<=\"&(I218+1),SIZE,\">0\")","v":0}]
[null,null,{"$f":"I218+1","v":"2021-03-07"},{"$f":"C221+1","v":"2021-03-08"},{"$f":"D221+1","v":"2021-03-09"},"2021-03-10","2021-03-11","2021-03-12","2021-03-13"]
[null,null,{"$f":"SUMIFS('TRADE LOG'!$T$15:$T$9733,closeDate,\">\"&CALENDAR!C221,closeDate,\"<=\"&D221,SIZE,\">0\")","v":0},{"$f":"SUMIFS('TRADE LOG'!$T$15:$T$9733,closeDate,\">\"&CALENDAR!D221,closeDate,\"<=\"&E221,SIZE,\">0\")","v":0},{"$f":"SUMIFS('TRADE LOG'!$T$15:$T$9733,closeDate,\">\"&CALENDAR!E221,closeDate,\"<=\"&F221,SIZE,\">0\")","v":0},{"$f":"SUMIFS('TRADE LOG'!$T$15:$T$9733,closeDate,\">\"&CALENDAR!F221,closeDate,\"<=\"&G221,SIZE,\">0\")","v":0},{"$f":"SUMIFS('TRADE LOG'!$T$15:$T$9733,closeDate,\">\"&CALENDAR!G221,closeDate,\"<=\"&H221,SIZE,\">0\")","v":0},{"$f":"SUMIFS('TRADE LOG'!$T$15:$T$9733,closeDate,\">\"&CALENDAR!H221,closeDate,\"<=\"&I221,SIZE,\">0\")","v":0},{"$f":"SUMIFS('TRADE LOG'!$T$15:$T$9733,closeDate,\">\"&CALENDAR!I221,closeDate,\"<=\"&C224,SIZE,\">0\")","v":0}]
[null,null,{"$f":"COUNTIFS(closeDate,\">\"&CALENDAR!C221,closeDate,\"<=\"&D221,SIZE,\">0\")","v":0},{"$f":"COUNTIFS(closeDate,\">\"&CALENDAR!D221,closeDate,\"<=\"&E221,SIZE,\">0\")","v":0},{"$f":"COUNTIFS(closeDate,\">\"&CALENDAR!E221,closeDate,\"<=\"&F221,SIZE,\">0\")","v":0},{"$f":"COUNTIFS(closeDate,\">\"&CALENDAR!F221,closeDate,\"<=\"&G221,SIZE,\">0\")","v":0},{"$f":"COUNTIFS(closeDate,\">\"&CALENDAR!G221,closeDate,\"<=\"&H221,SIZE,\">0\")","v":0},{"$f":"COUNTIFS(closeDate,\">\"&CALENDAR!H221,closeDate,\"<=\"&I221,SIZE,\">0\")","v":0},{"$f":"COUNTIFS(closeDate,\">\"&CALENDAR!I221,closeDate,\"<=\"&(I221+1),SIZE,\">0\")","v":0}]
[null,null,{"$f":"I221+1","v":"2021-03-14"},{"$f":"C224+1","v":"2021-03-15"},{"$f":"D224+1","v":"2021-03-16"},"2021-03-17","2021-03-18","2021-03-19","2021-03-20"]
[null,null,{"$f":"SUMIFS('TRADE LOG'!$T$15:$T$9733,closeDate,\">\"&CALENDAR!C224,closeDate,\"<=\"&D224,SIZE,\">0\")","v":0},{"$f":"SUMIFS('TRADE LOG'!$T$15:$T$9733,closeDate,\">\"&CALENDAR!D224,closeDate,\"<=\"&E224,SIZE,\">0\")","v":0},{"$f":"SUMIFS('TRADE LOG'!$T$15:$T$9733,closeDate,\">\"&CALENDAR!E224,closeDate,\"<=\"&F224,SIZE,\">0\")","v":0},{"$f":"SUMIFS('TRADE LOG'!$T$15:$T$9733,closeDate,\">\"&CALENDAR!F224,closeDate,\"<=\"&G224,SIZE,\">0\")","v":0},{"$f":"SUMIFS('TRADE LOG'!$T$15:$T$9733,closeDate,\">\"&CALENDAR!G224,closeDate,\"<=\"&H224,SIZE,\">0\")","v":0},{"$f":"SUMIFS('TRADE LOG'!$T$15:$T$9733,closeDate,\">\"&CALENDAR!H224,closeDate,\"<=\"&I224,SIZE,\">0\")","v":0},{"$f":"SUMIFS('TRADE LOG'!$T$15:$T$9733,closeDate,\">\"&CALENDAR!I224,closeDate,\"<=\"&C227,SIZE,\">0\")","v":0}]
[null,null,{"$f":"COUNTIFS(closeDate,\">\"&CALENDAR!C224,closeDate,\"<=\"&D224,SIZE,\">0\")","v":0},{"$f":"COUNTIFS(closeDate,\">\"&CALENDAR!D224,closeDate,\"<=\"&E224,SIZE,\">0\")","v":0},{"$f":"COUNTIFS(closeDate,\">\"&CALENDAR!E224,closeDate,\"<=\"&F224,SIZE,\">0\")","v":0},{"$f":"COUNTIFS(closeDate,\">\"&CALENDAR!F224,closeDate,\"<=\"&G224,SIZE,\">0\")","v":0},{"$f":"COUNTIFS(closeDate,\">\"&CALENDAR!G224,closeDate,\"<=\"&H224,SIZE,\">0\")","v":0},{"$f":"COUNTIFS(closeDate,\">\"&CALENDAR!H224,closeDate,\"<=\"&I224,SIZE,\">0\")","v":0},{"$f":"COUNTIFS(closeDate,\">\"&CALENDAR!I224,closeDate,\"<=\"&(I224+1),SIZE,\">0\")","v":0}]
[null,null,{"$f":"I224+1","v":"2021-03-21"},{"$f":"C227+1","v":"2021-03-22"},{"$f":"D227+1","v":"2021-03-23"},"2021-03-24","2021-03-25","2021-03-26","2021-03-27"]
[null,null,{"$f":"SUMIFS('TRADE LOG'!$T$15:$T$9733,closeDate,\">\"&CALENDAR!C227,closeDate,\"<=\"&D227,SIZE,\">0\")","v":0},{"$f":"SUMIFS('TRADE LOG'!$T$15:$T$9733,closeDate,\">\"&CALENDAR!D227,closeDate,\"<=\"&E227,SIZE,\">0\")","v":0},{"$f":"SUMIFS('TRADE LOG'!$T$15:$T$9733,closeDate,\">\"&CALENDAR!E227,closeDate,\"<=\"&F227,SIZE,\">0\")","v":0},{"$f":"SUMIFS('TRADE LOG'!$T$15:$T$9733,closeDate,\">\"&CALENDAR!F227,closeDate,\"<=\"&G227,SIZE,\">0\")","v":0},{"$f":"SUMIFS('TRADE LOG'!$T$15:$T$9733,closeDate,\">\"&CALENDAR!G227,closeDate,\"<=\"&H227,SIZE,\">0\")","v":0},{"$f":"SUMIFS('TRADE LOG'!$T$15:$T$9733,closeDate,\">\"&CALENDAR!H227,closeDate,\"<=\"&I227,SIZE,\">0\")","v":0},{"$f":"SUMIFS('TRADE LOG'!$T$15:$T$9733,closeDate,\">\"&CALENDAR!I227,closeDate,\"<=\"&C230,SIZE,\">0\")","v":0}]
[null,null,{"$f":"COUNTIFS(closeDate,\">\"&CALENDAR!C227,closeDate,\"<=\"&D227,SIZE,\">0\")","v":0},{"$f":"COUNTIFS(closeDate,\">\"&CALENDAR!D227,closeDate,\"<=\"&E227,SIZE,\">0\")","v":0},{"$f":"COUNTIFS(closeDate,\">\"&CALENDAR!E227,closeDate,\"<=\"&F227,SIZE,\">0\")","v":0},{"$f":"COUNTIFS(closeDate,\">\"&CALENDAR!F227,closeDate,\"<=\"&G227,SIZE,\">0\")","v":0},{"$f":"COUNTIFS(closeDate,\">\"&CALENDAR!G227,closeDate,\"<=\"&H227,SIZE,\">0\")","v":0},{"$f":"COUNTIFS(closeDate,\">\"&CALENDAR!H227,closeDate,\"<=\"&I227,SIZE,\">0\")","v":0},{"$f":"COUNTIFS(closeDate,\">\"&CALENDAR!I227,closeDate,\"<=\"&(I227+1),SIZE,\">0\")","v":0}]
[null,null,{"$f":"IFERROR(IF(MONTH(C216)<>MONTH(I227+1),\"\",(I227+1)),\"\")","v":"2021-03-28"},{"$f":"IFERROR(IF(MONTH(C216)<>MONTH(C230+1),\"\",(C230+1)),\"\")","v":"2021-03-29"},{"$f":"IFERROR(IF(MONTH(C216)<>MONTH(D230+1),\"\",(D230+1)),\"\")","v":"2021-03-30"},{"$f":"IFERROR(IF(MONTH(C216)<>MONTH(E230+1),\"\",(E230+1)),\"\")","v":"2021-03-31"},{"$f":"IFERROR(IF(MONTH(C216)<>MONTH(F230+1),\"\",(F230+1)),\"\")","v":""},{"$f":"IFERROR(IF(MONTH(C216)<>MONTH(G230+1),\"\",(G230+1)),\"\")","v":""},{"$f":"IFERROR(IF(MONTH(C216)<>MONTH(H230+1),\"\",(H230+1)),\"\")","v":""}]
[null,null,{"$f":"SUMIFS('TRADE LOG'!$T$15:$T$9733,closeDate,\">\"&CALENDAR!C230,closeDate,\"<=\"&D230,SIZE,\">0\")","v":0},{"$f":"SUMIFS('TRADE LOG'!$T$15:$T$9733,closeDate,\">\"&CALENDAR!D230,closeDate,\"<=\"&E230,SIZE,\">0\")","v":0},{"$f":"SUMIFS('TRADE LOG'!$T$15:$T$9733,closeDate,\">\"&CALENDAR!E230,closeDate,\"<=\"&F230,SIZE,\">0\")","v":0},{"$f":"SUMIFS('TRADE LOG'!$T$15:$T$9733,closeDate,\">\"&CALENDAR!F230,closeDate,\"<=\"&G230,SIZE,\">0\")","v":0},{"$f":"SUMIFS('TRADE LOG'!$T$15:$T$9733,closeDate,\">\"&CALENDAR!G230,closeDate,\"<=\"&H230,SIZE,\">0\")","v":0},{"$f":"SUMIFS('TRADE LOG'!$T$15:$T$9733,closeDate,\">\"&CALENDAR!H230,closeDate,\"<=\"&I230,SIZE,\">0\")","v":0},{"$f":"SUMIFS('TRADE LOG'!$T$15:$T$9733,closeDate,\">\"&CALENDAR!I230,closeDate,\"<=\"&C233,SIZE,\">0\")","v":0}]
[null,null,{"$f":"COUNTIFS(closeDate,\">\"&CALENDAR!C230,closeDate,\"<=\"&D230,SIZE,\">0\")","v":0},{"$f":"COUNTIFS(closeDate,\">\"&CALENDAR!D230,closeDate,\"<=\"&E230,SIZE,\">0\")","v":0},{"$f":"COUNTIFS(closeDate,\">\"&CALENDAR!E230,closeDate,\"<=\"&F230,SIZE,\">0\")","v":0},{"$f":"COUNTIFS(closeDate,\">\"&CALENDAR!F230,closeDate,\"<=\"&G230,SIZE,\">0\")","v":0},{"$f":"COUNTIFS(closeDate,\">\"&CALENDAR!G230,closeDate,\"<=\"&H230,SIZE,\">0\")","v":0},{"$f":"COUNTIFS(closeDate,\">\"&CALENDAR!H230,closeDate,\"<=\"&I230,SIZE,\">0\")","v":0},{"$f":"COUNTIFS(closeDate,\">\"&CALENDAR!I230,closeDate,\"<=\"&(I230+1),SIZE,\">0\")","v":0}]
[null,null,{"$f":"IFERROR(IF(MONTH(C216)<>MONTH(I230+1),\"\",(I230+1)),\"\")","v":""},{"$f":"IFERROR(IF(MONTH(C216)<>MONTH(C233+1),\"\",(C233+1)),\"\")","v":""},{"$f":"IFERROR(IF(MONTH(C216)<>MONTH(D233+1),\"\",(D233+1)),\"\")","v":""},{"$f":"IFERROR(IF(MONTH(C216)<>MONTH(E233+1),\"\",(E233+1)),\"\")","v":""},{"$f":"IFERROR(IF(MONTH(C216)<>MONTH(F233+1),\"\",(F233+1)),\"\")","v":""},{"$f":"IFERROR(IF(MONTH(C216)<>MONTH(G233+1),\"\",(G233+1)),\"\")","v":""},{"$f":"IFERROR(IF(MONTH(C216)<>MONTH(H233+1),\"\",(H233+1)),\"\")","v":""}]
[null,null,{"$f":"SUMIFS('TRADE LOG'!$T$15:$T$9733,closeDate,\">\"&CALENDAR!C233,closeDate,\"<=\"&D233,SIZE,\">0\")","v":0},{"$f":"SUMIFS('TRADE LOG'!$T$15:$T$9733,closeDate,\">\"&CALENDAR!D233,closeDate,\"<=\"&E233,SIZE,\">0\")","v":0},{"$f":"SUMIFS('TRADE LOG'!$T$15:$T$9733,closeDate,\">\"&CALENDAR!E233,closeDate,\"<=\"&F233,SIZE,\">0\")","v":0},{"$f":"SUMIFS('TRADE LOG'!$T$15:$T$9733,closeDate,\">\"&CALENDAR!F233,closeDate,\"<=\"&G233,SIZE,\">0\")","v":0},{"$f":"SUMIFS('TRADE LOG'!$T$15:$T$9733,closeDate,\">\"&CALENDAR!G233,closeDate,\"<=\"&H233,SIZE,\">0\")","v":0},{"$f":"SUMIFS('TRADE LOG'!$T$15:$T$9733,closeDate,\">\"&CALENDAR!H233,closeDate,\"<=\"&I233,SIZE,\">0\")","v":0},{"$f":"SUMIFS('TRADE LOG'!$T$15:$T$9733,closeDate,\">\"&CALENDAR!I233,closeDate,\"<=\"&C236,SIZE,\">0\")","v":0}]
[null,null,{"$f":"COUNTIFS(closeDate,\">\"&CALENDAR!C233,closeDate,\"<=\"&D233,SIZE,\">0\")","v":0},{"$f":"COUNTIFS(closeDate,\">\"&CALENDAR!D233,closeDate,\"<=\"&E233,SIZE,\">0\")","v":0},{"$f":"COUNTIFS(closeDate,\">\"&CALENDAR!E233,closeDate,\"<=\"&F233,SIZE,\">0\")","v":0},{"$f":"COUNTIFS(closeDate,\">\"&CALENDAR!F233,closeDate,\"<=\"&G233,SIZE,\">0\")","v":0},{"$f":"COUNTIFS(closeDate,\">\"&CALENDAR!G233,closeDate,\"<=\"&H233,SIZE,\">0\")","v":0},{"$f":"COUNTIFS(closeDate,\">\"&CALENDAR!H233,closeDate,\"<=\"&I233,SIZE,\">0\")","v":0},{"$f":"COUNTIFS(closeDate,\">\"&CALENDAR!I233,closeDate,\"<=\"&(I233+1),SIZE,\">0\")","v":0}]
[]
[null,null,{"$f":"EOMONTH(C216,0)+1","v":"2021-04-01"}]
[null,null,"SUN","MON","TUE","WED","THU","FRI","SAT"]
[null,null,{"$f":"IF(MONTH(C237)<>MONTH((C237-WEEKDAY(C237,1)+1)),\"\",(C237-WEEKDAY(C237,1)+1))","v":""},{"$f":"IF(MONTH(C237)<>MONTH((C237-WEEKDAY(C237,1)+2)),\"\",(C237-WEEKDAY(C237,1)+2))","v":""},{"$f":"IF(MONTH(C237)<>MONTH((C237-WEEKDAY(C237,1)+3)),\"\",(C237-WEEKDAY(C237,1)+3))","v":""},{"$f":"IF(MONTH(C237)<>MONTH((C237-WEEKDAY(C237,1)+4)),\"\",(C237-WEEKDAY(C237,1)+4))","v":""},{"$f":"IF(MONTH(C237)<>MONTH((C237-WEEKDAY(C237,1)+5)),\"\",(C237-WEEKDAY(C237,1)+5))","v":"2021-04-01"},{"$f":"IF(MONTH(C237)<>MONTH((C237-WEEKDAY(C237,1)+6)),\"\",(C237-WEEKDAY(C237,1)+6))","v":"2021-04-02"},{"$f":"IF(MONTH(C237)<>MONTH((C237-WEEKDAY(C237,1)+7)),\"\",(C237-WEEKDAY(C237,1)+7))","v":"2021-04-03"}]
[null,null,{"$f":"SUMIFS('TRADE LOG'!$T$15:$T$9733,closeDate,\">\"&CALENDAR!C239,closeDate,\"<=\"&D239,SIZE,\">0\")","v":0},{"$f":"SUMIFS('TRADE LOG'!$T$15:$T$9733,closeDate,\">\"&CALENDAR!D239,closeDate,\"<=\"&E239,SIZE,\">0\")","v":0},{"$f":"SUMIFS('TRADE LOG'!$T$15:$T$9733,closeDate,\">\"&CALENDAR!E239,closeDate,\"<=\"&F239,SIZE,\">0\")","v":0},{"$f":"SUMIFS('TRADE LOG'!$T$15:$T$9733,closeDate,\">\"&CALENDAR!F239,closeDate,\"<=\"&G239,SIZE,\">0\")","v":0},{"$f":"SUMIFS('TRADE LOG'!$T$15:$T$9733,closeDate,\">\"&CALENDAR!G239,closeDate,\"<=\"&H239,SIZE,\">0\")","v":0},{"$f":"SUMIFS('TRADE LOG'!$T$15:$T$9733,closeDate,\">\"&CALENDAR!H239,closeDate,\"<=\"&I239,SIZE,\">0\")","v":0},{"$f":"SUMIFS('TRADE LOG'!$T$15:$T$9733,closeDate,\">\"&CALENDAR!I239,closeDate,\"<=\"&C242,SIZE,\">0\")","v":0}]
[null,null,{"$f":"COUNTIFS(closeDate,\">\"&CALENDAR!C239,closeDate,\"<=\"&D239,SIZE,\">0\")","v":0},{"$f":"COUNTIFS(closeDate,\">\"&CALENDAR!D239,closeDate,\"<=\"&E239,SIZE,\">0\")","v":0},{"$f":"COUNTIFS(closeDate,\">\"&CALENDAR!E239,closeDate,\"<=\"&F239,SIZE,\">0\")","v":0},{"$f":"COUNTIFS(closeDate,\">\"&CALENDAR!F239,closeDate,\"<=\"&G239,SIZE,\">0\")","v":0},{"$f":"COUNTIFS(closeDate,\">\"&CALENDAR!G239,closeDate,\"<=\"&H239,SIZE,\">0\")","v":0},{"$f":"COUNTIFS(closeDate,\">\"&CALENDAR!H239,closeDate,\"<=\"&I239,SIZE,\">0\")","v":0},{"$f":"COUNTIFS(closeDate,\">\"&CALENDAR!I239,closeDate,\"<=\"&(I239+1),SIZE,\">0\")","v":0}]
[null,null,{"$f":"I239+1","v":"2021-04-04"},{"$f":"C242+1","v":"2021-04-05"},{"$f":"D242+1","v":"2021-04-06"},"2021-04-07","2021-04-08","2021-04-09","2021-04-10"]
[null,null,{"$f":"SUMIFS('TRADE LOG'!$T$15:$T$9733,closeDate,\">\"&CALENDAR!C242,closeDate,\"<=\"&D242,SIZE,\">0\")","v":0},{"$f":"SUMIFS('TRADE LOG'!$T$15:$T$9733,closeDate,\">\"&CALENDAR!D242,closeDate,\"<=\"&E242,SIZE,\">0\")","v":0},{"$f":"SUMIFS('TRADE LOG'!$T$15:$T$9733,closeDate,\">\"&CALENDAR!E242,closeDate,\"<=\"&F242,SIZE,\">0\")","v":0},{"$f":"SUMIFS('TRADE LOG'!$T$15:$T$9733,closeDate,\">\"&CALENDAR!F242,closeDate,\"<=\"&G242,SIZE,\">0\")","v":0},{"$f":"SUMIFS('TRADE LOG'!$T$15:$T$9733,closeDate,\">\"&CALENDAR!G242,closeDate,\"<=\"&H242,SIZE,\">0\")","v":0},{"$f":"SUMIFS('TRADE LOG'!$T$15:$T$9733,closeDate,\">\"&CALENDAR!H242,closeDate,\"<=\"&I242,SIZE,\">0\")","v":0},{"$f":"SUMIFS('TRADE LOG'!$T$15:$T$9733,closeDate,\">\"&CALENDAR!I242,closeDate,\"<=\"&C245,SIZE,\">0\")","v":0}]
[null,null,{"$f":"COUNTIFS(closeDate,\">\"&CALENDAR!C242,closeDate,\"<=\"&D242,SIZE,\">0\")","v":0},{"$f":"COUNTIFS(closeDate,\">\"&CALENDAR!D242,closeDate,\"<=\"&E242,SIZE,\">0\")","v":0},{"$f":"COUNTIFS(closeDate,\">\"&CALENDAR!E242,closeDate,\"<=\"&F242,SIZE,\">0\")","v":0},{"$f":"COUNTIFS(closeDate,\">\"&CALENDAR!F242,closeDate,\"<=\"&G242,SIZE,\">0\")","v":0},{"$f":"COUNTIFS(closeDate,\">\"&CALENDAR!G242,closeDate,\"<=\"&H242,SIZE,\">0\")","v":0},{"$f":"COUNTIFS(closeDate,\">\"&CALENDAR!H242,closeDate,\"<=\"&I242,SIZE,\">0\")","v":0},{"$f":"COUNTIFS(closeDate,\">\"&CALENDAR!I242,closeDate,\"<=\"&(I242+1),SIZE,\">0\")","v":0}]
[null,null,{"$f":"I242+1","v":"2021-04-11"},{"$f":"C245+1","v":"2021-04-12"},{"$f":"D245+1","v":"2021-04-13"},"2021-04-14","2021-04-15","2021-04-16","2021-04-17"]
[null,null,{"$f":"SUMIFS('TRADE LOG'!$T$15:$T$9733,closeDate,\">\"&CALENDAR!C245,closeDate,\"<=\"&D245,SIZE,\">0\")","v":0},{"$f":"SUMIFS('TRADE LOG'!$T$15:$T$9733,closeDate,\">\"&CALENDAR!D245,closeDate,\"<=\"&E245,SIZE,\">0\")","v":0},{"$f":"SUMIFS('TRADE LOG'!$T$15:$T$9733,closeDate,\">\"&CALENDAR!E245,closeDate,\"<=\"&F245,SIZE,\">0\")","v":0},{"$f":"SUMIFS('TRADE LOG'!$T$15:$T$9733,closeDate,\">\"&CALENDAR!F245,closeDate,\"<=\"&G245,SIZE,\">0\")","v":0},{"$f":"SUMIFS('TRADE LOG'!$T$15:$T$9733,closeDate,\">\"&CALENDAR!G245,closeDate,\"<=\"&H245,SIZE,\">0\")","v":0},{"$f":"SUMIFS('TRADE LOG'!$T$15:$T$9733,closeDate,\">\"&CALENDAR!H245,closeDate,\"<=\"&I245,SIZE,\">0\")","v":0},{"$f":"SUMIFS('TRADE LOG'!$T$15:$T$9733,closeDate,\">\"&CALENDAR!I245,closeDate,\"<=\"&C248,SIZE,\">0\")","v":0}]
[null,null,{"$f":"COUNTIFS(closeDate,\">\"&CALENDAR!C245,closeDate,\"<=\"&D245,SIZE,\">0\")","v":0},{"$f":"COUNTIFS(closeDate,\">\"&CALENDAR!D245,closeDate,\"<=\"&E245,SIZE,\">0\")","v":0},{"$f":"COUNTIFS(closeDate,\">\"&CALENDAR!E245,closeDate,\"<=\"&F245,SIZE,\">0\")","v":0},{"$f":"COUNTIFS(closeDate,\">\"&CALENDAR!F245,closeDate,\"<=\"&G245,SIZE,\">0\")","v":0},{"$f":"COUNTIFS(closeDate,\">\"&CALENDAR!G245,closeDate,\"<=\"&H245,SIZE,\">0\")","v":0},{"$f":"COUNTIFS(closeDate,\">\"&CALENDAR!H245,closeDate,\"<=\"&I245,SIZE,\">0\")","v":0},{"$f":"COUNTIFS(closeDate,\">\"&CALENDAR!I245,closeDate,\"<=\"&(I245+1),SIZE,\">0\")","v":0}]
[null,null,{"$f":"I245+1","v":"2021-04-18"},{"$f":"C248+1","v":"2021-04-19"},{"$f":"D248+1","v":"2021-04-20"},"2021-04-21","2021-04-22","2021-04-23","2021-04-24"]
[null,null,{"$f":"SUMIFS('TRADE LOG'!$T$15:$T$9733,closeDate,\">\"&CALENDAR!C248,closeDate,\"<=\"&D248,SIZE,\">0\")","v":0},{"$f":"SUMIFS('TRADE LOG'!$T$15:$T$9733,closeDate,\">\"&CALENDAR!D248,closeDate,\"<=\"&E248,SIZE,\">0\")","v":0},{"$f":"SUMIFS('TRADE LOG'!$T$15:$T$9733,closeDate,\">\"&CALENDAR!E248,closeDate,\"<=\"&F248,SIZE,\">0\")","v":0},{"$f":"SUMIFS('TRADE LOG'!$T$15:$T$9733,closeDate,\">\"&CALENDAR!F248,closeDate,\"<=\"&G248,SIZE,\">0\")","v":0},{"$f":"SUMIFS('TRADE LOG'!$T$15:$T$9733,closeDate,\">\"&CALENDAR!G248,closeDate,\"<=\"&H248,SIZE,\">0\")","v":0},{"$f":"SUMIFS('TRADE LOG'!$T$15:$T$9733,closeDate,\">\"&CALENDAR!H248,closeDate,\"<=\"&I248,SIZE,\">0\")","v":0},{"$f":"SUMIFS('TRADE LOG'!$T$15:$T$9733,closeDate,\">\"&CALENDAR!I248,closeDate,\"<=\"&C251,SIZE,\">0\")","v":0}]
[null,null,{"$f":"COUNTIFS(closeDate,\">\"&CALENDAR!C248,closeDate,\"<=\"&D248,SIZE,\">0\")","v":0},{"$f":"COUNTIFS(closeDate,\">\"&CALENDAR!D248,closeDate,\"<=\"&E248,SIZE,\">0\")","v":0},{"$f":"COUNTIFS(closeDate,\">\"&CALENDAR!E248,closeDate,\"<=\"&F248,SIZE,\">0\")","v":0},{"$f":"COUNTIFS(closeDate,\">\"&CALENDAR!F248,closeDate,\"<=\"&G248,SIZE,\">0\")","v":0},{"$f":"COUNTIFS(closeDate,\">\"&CALENDAR!G248,closeDate,\"<=\"&H248,SIZE,\">0\")","v":0},{"$f":"COUNTIFS(closeDate,\">\"&CALENDAR!H248,closeDate,\"<=\"&I248,SIZE,\">0\")","v":0},{"$f":"COUNTIFS(closeDate,\">\"&CALENDAR!I248,closeDate,\"<=\"&(I248+1),SIZE,\">0\")","v":0}]
[null,null,{"$f":"IFERROR(IF(MONTH(C237)<>MONTH(I248+1),\"\",(I248+1)),\"\")","v":"2021-04-25"},{"$f":"IFERROR(IF(MONTH(C237)<>MONTH(C251+1),\"\",(C251+1)),\"\")","v":"2021-04-26"},{"$f":"IFERROR(IF(MONTH(C237)<>MONTH(D251+1),\"\",(D251+1)),\"\")","v":"2021-04-27"},{"$f":"IFERROR(IF(MONTH(C237)<>MONTH(E251+1),\"\",(E251+1)),\"\")","v":"2021-04-28"},{"$f":"IFERROR(IF(MONTH(C237)<>MONTH(F251+1),\"\",(F251+1)),\"\")","v":"2021-04-29"},{"$f":"IFERROR(IF(MONTH(C237)<>MONTH(G251+1),\"\",(G251+1)),\"\")","v":"2021-04-30"},{"$f":"IFERROR(IF(MONTH(C237)<>MONTH(H251+1),\"\",(H251+1)),\"\")","v":""}]
[null,null,{"$f":"SUMIFS('TRADE LOG'!$T$15:$T$9733,closeDate,\">\"&CALENDAR!C251,closeDate,\"<=\"&D251,SIZE,\">0\")","v":0},{"$f":"SUMIFS('TRADE LOG'!$T$15:$T$9733,closeDate,\">\"&CALENDAR!D251,closeDate,\"<=\"&E251,SIZE,\">0\")","v":0},{"$f":"SUMIFS('TRADE LOG'!$T$15:$T$9733,closeDate,\">\"&CALENDAR!E251,closeDate,\"<=\"&F251,SIZE,\">0\")","v":0},{"$f":"SUMIFS('TRADE LOG'!$T$15:$T$9733,closeDate,\">\"&CALENDAR!F251,closeDate,\"<=\"&G251,SIZE,\">0\")","v":0},{"$f":"SUMIFS('TRADE LOG'!$T$15:$T$9733,closeDate,\">\"&CALENDAR!G251,closeDate,\"<=\"&H251,SIZE,\">0\")","v":0},{"$f":"SUMIFS('TRADE LOG'!$T$15:$T$9733,closeDate,\">\"&CALENDAR!H251,closeDate,\"<=\"&I251,SIZE,\">0\")","v":0},{"$f":"SUMIFS('TRADE LOG'!$T$15:$T$9733,closeDate,\">\"&CALENDAR!I251,closeDate,\"<=\"&C254,SIZE,\">0\")","v":0}]
[null,null,{"$f":"COUNTIFS(closeDate,\">\"&CALENDAR!C251,closeDate,\"<=\"&D251,SIZE,\">0\")","v":0},{"$f":"COUNTIFS(closeDate,\">\"&CALENDAR!D251,closeDate,\"<=\"&E251,SIZE,\">0\")","v":0},{"$f":"COUNTIFS(closeDate,\">\"&CALENDAR!E251,closeDate,\"<=\"&F251,SIZE,\">0\")","v":0},{"$f":"COUNTIFS(closeDate,\">\"&CALENDAR!F251,closeDate,\"<=\"&G251,SIZE,\">0\")","v":0},{"$f":"COUNTIFS(closeDate,\">\"&CALENDAR!G251,closeDate,\"<=\"&H251,SIZE,\">0\")","v":0},{"$f":"COUNTIFS(closeDate,\">\"&CALENDAR!H251,closeDate,\"<=\"&I251,SIZE,\">0\")","v":0},{"$f":"COUNTIFS(closeDate,\">\"&CALENDAR!I251,closeDate,\"<=\"&(I251+1),SIZE,\">0\")","v":0}]
[null,null,{"$f":"IFERROR(IF(MONTH(C237)<>MONTH(I251+1),\"\",(I251+1)),\"\")","v":""},{"$f":"IFERROR(IF(MONTH(C237)<>MONTH(C254+1),\"\",(C254+1)),\"\")","v":""},{"$f":"IFERROR(IF(MONTH(C237)<>MONTH(D254+1),\"\",(D254+1)),\"\")","v":""},{"$f":"IFERROR(IF(MONTH(C237)<>MONTH(E254+1),\"\",(E254+1)),\"\")","v":""},{"$f":"IFERROR(IF(MONTH(C237)<>MONTH(F254+1),\"\",(F254+1)),\"\")","v":""},{"$f":"IFERROR(IF(MONTH(C237)<>MONTH(G254+1),\"\",(G254+1)),\"\")","v":""},{"$f":"IFERROR(IF(MONTH(C237)<>MONTH(H254+1),\"\",(H254+1)),\"\")","v":""}]
[null,null,{"$f":"SUMIFS('TRADE LOG'!$T$15:$T$9733,closeDate,\">\"&CALENDAR!C254,closeDate,\"<=\"&D254,SIZE,\">0\")","v":0},{"$f":"SUMIFS('TRADE LOG'!$T$15:$T$9733,closeDate,\">\"&CALENDAR!D254,closeDate,\"<=\"&E254,SIZE,\">0\")","v":0},{"$f":"SUMIFS('TRADE LOG'!$T$15:$T$9733,closeDate,\">\"&CALENDAR!E254,closeDate,\"<=\"&F254,SIZE,\">0\")","v":0},{"$f":"SUMIFS('TRADE LOG'!$T$15:$T$9733,closeDate,\">\"&CALENDAR!F254,closeDate,\"<=\"&G254,SIZE,\">0\")","v":0},{"$f":"SUMIFS('TRADE LOG'!$T$15:$T$9733,closeDate,\">\"&CALENDAR!G254,closeDate,\"<=\"&H254,SIZE,\">0\")","v":0},{"$f":"SUMIFS('TRADE LOG'!$T$15:$T$9733,closeDate,\">\"&CALENDAR!H254,closeDate,\"<=\"&I254,SIZE,\">0\")","v":0},{"$f":"SUMIFS('TRADE LOG'!$T$15:$T$9733,closeDate,\">\"&CALENDAR!I254,closeDate,\"<=\"&C257,SIZE,\">0\")","v":0}]
[null,null,{"$f":"COUNTIFS(closeDate,\">\"&CALENDAR!C254,closeDate,\"<=\"&D254,SIZE,\">0\")","v":0},{"$f":"COUNTIFS(closeDate,\">\"&CALENDAR!D254,closeDate,\"<=\"&E254,SIZE,\">0\")","v":0},{"$f":"COUNTIFS(closeDate,\">\"&CALENDAR!E254,closeDate,\"<=\"&F254,SIZE,\">0\")","v":0},{"$f":"COUNTIFS(closeDate,\">\"&CALENDAR!F254,closeDate,\"<=\"&G254,SIZE,\">0\")","v":0},{"$f":"COUNTIFS(closeDate,\">\"&CALENDAR!G254,closeDate,\"<=\"&H254,SIZE,\">0\")","v":0},{"$f":"COUNTIFS(closeDate,\">\"&CALENDAR!H254,closeDate,\"<=\"&I254,SIZE,\">0\")","v":0},{"$f":"COUNTIFS(closeDate,\">\"&CALENDAR!I254,closeDate,\"<=\"&(I254+1),SIZE,\">0\")","v":0}]

{"sheet":"SETTINGS","index":8,"n_rows":190,"n_cols":56,"rows_kept":190,"hidden":true,"merged":[[11,18,11,23],[12,18,12,23],[13,18,13,23],[14,18,14,23],[15,18,15,23],[16,18,16,23],[17,18,17,23],[18,18,18,23],[19,18,19,23],[20,12,21,15],[20,18,20,23],[21,18,21,23],[22,18,22,23]]}
[{"$nulls":12},"  SETTINGS",{"$nulls":16},"D:\\00-SPREADSHEET\\00 - COMPANY PROFILE\\14- LOGO\\RocketSheets\\Published\\rocketsheets-LOGO-200.png",{"$nulls":6},"selected",{"$f":"VLOOKUP(O3,AK2:AL14,2,0)","v":"$"}]
[{"$nulls":12},"         ACCOUNT SETTINGS",{"$nulls":4},"    RISK SETTINGS",{"$nulls":3}," LOG SETTINGS",{"$nulls":4},"    PROFILE SETTINGS",{"$nulls":3},{"$f":"S3*(1+S5)","v":0.011000000000000001},null,{"$f":"DATE(YEAR(AH2),MONTH(AH2),DAY(1))","v":"2023-03-01"},"2023-03-17","REWARD-RISK RATIO",null,"USD","$"]
[{"$nulls":12},"         Account Currency:",null,"USD",null,null,"    Equity%  to Risk (1R):",{"v":0.01,"d":"1.00%"},null,null,"Retain Formula",{"v":50,"d":"50 Rows"},{"$nulls":3},"   Insert 100x100 pixels,",{"$nulls":5},{"$f":"EOMONTH(AG2,0)+1","v":"2023-04-01"},{"$f":"IF(V7=\"today\",TODAY(),MAX('TRADE LOG'!AT15:AT9733))","v":"2020-06-01T08:33:50.384"},"PROFIT-LOSS RATIO",null,"EUR","€"]
[{"$nulls":12},"         Account Leverage:",null,{"v":100,"d":"1 : 100"},null,null,"    Plan RRR Ratio :",{"v":2,"d":"2R"},null,null,"Rows to Add",{"v":100,"d":"100 Rows"},{"$nulls":3},"   max 20kb",{"$nulls":9},"CHF","CHf"]
[{"$nulls":12},"         Account Margin:",null,{"$f":"1/O4","v":{"v":0.01,"d":"1.00%"}},null,null,"   1R Allowable Range%",{"v":0.1,"d":"10%"},{"$nulls":7},"   Format : .jpg / .gif / .png",{"$nulls":9},"GBP","£"]
[{"$nulls":21}," REPORT DATE",{"$f":"AH2","v":"2023-03-17"},{"$nulls":13},"CAD","CAD",null,{"$f":"AA13","v":"REWARD-RISK RATIO"}]
[{"$nulls":17},"    Current VAR:",{"$f":"'MONTHLY REPORT'!J14*SETTINGS!S3","v":{"v":542.7142,"d":"$542.71"}},null,null,"Last Data Date",{"$nulls":14},"JPY","¥‎"]
[{"$nulls":36},"AUD","A$"]
[{"$nulls":12},"    TRADE EVALUATION SETTINGS",{"$nulls":4},"   TRADE SETUP SETTINGS",{"$nulls":7},"    CHART SETTINGS",{"$nulls":10},"NZD","NZD"]
[{"$nulls":12},"ENTRY/EXIT","SCORE","EMOTION","SCORE",null,"SETUP","     SETUP DEFINITION AND RULES",{"$nulls":6},"    WIN RATE%  VS  RATIO",{"$nulls":10},"HKD","HKD"]
[{"$nulls":17},"NO SETUP",{"$nulls":8},"of loss trades may due to late exit, over allocate or hope",{"$nulls":3},1E-4,{"$nulls":5},"NOK","kr"]
[{"$nulls":12},"TOO EARLY",-1,"FEAR",-1,null,"Momentum","Your definition and rules here",{"$nulls":17},"SEK","kr"]
[{"$nulls":12},"TOO LATE",-1,"HOPE",-1,null,"Bounce","Your definition and rules here",{"$nulls":6},"   Ratio Settings:","REWARD-RISK RATIO",{"$nulls":9},"DKK","Kr."]
[{"$nulls":12},"NOT IN PLAN",-1,"GREED",-1,null,"Trend Follow","Your definition and rules here",{"$nulls":17},"ZAR","R"]
[{"$nulls":12},"AS PLANNED",1,"BORED",-1,null,"Swing Trade","Your definition and rules here",{"$nulls":6},"   BREAKEVEN CALCULATOR"]
[{"$nulls":12},"BROKE RULES",-1,"IMPULSE",-2,null,"Bottom fishing","Your definition and rules here",{"$nulls":6},"  Ratio:",2]
[{"$nulls":14},"FOMO",-1,null,"My Setup 1","Your definition and rules here",{"$nulls":6},"  Win rate%:",{"v":0.5,"d":"50%"}]
[{"$nulls":14},"CONFIDENT",1,null,"My Setup 2","Your definition and rules here",{"$nulls":6},{"$f":"\"   You need to have a win rate% of more than \"&TEXT(AC19,\"0%\")&\" to be profitable.\"","v":"   You need to have a win rate% of more than 33% to be profitable."}]
[{"$nulls":14},"HYPED",-1,null,"My Setup 3","Your definition and rules here",{"$nulls":6},"   FORMULA",null,null,{"$f":"1/(1+(AA16/1))","v":{"v":0.3333333333333333,"d":"33%"}}]
[{"$nulls":17},"My Setup 4","Your definition and rules here",{"$nulls":6},"   Reward-Risk ratio = Ave.Win% / Ave.Loss%"]
[{"$nulls":12},"*** Enter a positive value for a good trade and a negative value for a bad trade.",{"$nulls":4},"My Setup 5","Your definition and rules here",{"$nulls":6},"   Profit-Loss ratio = Ave.Profit / Ave.Loss"]
[]
[{"$nulls":48},{"$f":"IF(AG23=0,\"\",AP23+AQ23+AE23)","v":""},{"$f":"IFERROR((AJ23*AR23)-((1-AJ23)*-AS23),0)","v":0},{"$f":"LARGE($AW$23:$AW$23,AF23)","v":{"$error":"#NUM!"}},{"$f":"MATCH(AY23,$AW$23:$AW$23,0)","v":{"$error":"#NUM!"}},{"$f":"INDEX($R$11:$R$21,AZ23)","v":{"$error":"#NUM!"}},{"$f":"INDEX('TRADE LOG'!$EI$2:$EI$12,AZ23)","v":{"$error":"#NUM!"}},{"$f":"INDEX('TRADE LOG'!$DU$2:$DU$12,AZ23)","v":{"$error":"#NUM!"}},{"$f":"INDEX('TRADE LOG'!$DR$2:$DR$12,AZ23)","v":{"$error":"#NUM!"}}]
[{"$nulls":32},{"$f":"AH24+AI24","v":55},{"$f":"'TRADE STATISTICS'!BI4","v":25},{"$f":"'TRADE STATISTICS'!BJ4","v":30},{"$f":"AH24/AG24","v":0.45454545454545453},{"$f":"DASHBOARD!I37","v":0.06820304474998616},{"$f":"-DASHBOARD!I38","v":0.04451900858594662},{"$nulls":3},{"$f":"'MONTHLY REPORT'!AD6","v":13805.110000000002},{"$f":"'MONTHLY REPORT'!AE6","v":-9533.689999999997},{"$f":"AP24/AH24","v":552.2044000000001},{"$f":"AQ24/AI24","v":-317.78966666666656},{"$f":"IFERROR(AR24/(-AS24),\"\")","v":1.7376411441949557},null,null,{"$f":"IF(AG24=0,\"\",AP24+AQ24+AE24)","v":4271.4200000000055},{"$f":"IFERROR((AJ24*AR24)-((1-AJ24)*-AS24),0)","v":77.66218181818192}]
[{"$nulls":12},"   TERMS AND DEFINITIONS",{"$nulls":12},"    MARKET DEFAULT SETTINGS"]
[{"$nulls":31},"AUD/CHF"]
[{"$nulls":25},"MARKET",null,"CONTRACT SIZE","LEVERAGE",null,null,"AUD/JPY"]
[{"$nulls":12},"WIN RATE%",null,null,"Win rate% is how many trades you win out of all your trades.",{"$nulls":9},"  Forex/Program default Lot Units:",null,{"v":100000,"d":"100,000"},{"$f":"O4","v":{"v":100,"d":"1 : 100"}},null,null,"AUD/NZD"]
[{"$nulls":12},"(hit rate%, probability of win)",null,null,"Ex. 5 wins out of 10 trades = 5/10 = 50% win rate%",{"$nulls":9},"  Stocks/Indices/Crypto:",null,1,{"v":1,"d":"1 : 1"},null,null,"AUD/USD"]
[{"$nulls":25},"  Gold",null,100,{"v":1,"d":"1 : 1"},null,null,"BGN/RON"]
[{"$nulls":12},"REWARD-TO-RISK RATIO",null,null,"The ratio helps assess the expected return and risk of a given trade.",{"$nulls":15},"CAD/CHF"]
[{"$nulls":12},"(RRR)",null,null,"The reward-risk ratio used in this program is define as the average gain% over average loss%.",{"$nulls":9}," * For other market with different pip size and leverage",{"$nulls":5},"CAD/JPY"]
[{"$nulls":15},"Ex. 10% average gain / 5% average loss = 10%/5% = 2 : 1 RRR",{"$nulls":9},"   Manually encode it for each trade on the trade log sheet.",{"$nulls":5},"CHF/BGN"]
[{"$nulls":25}," * Leaving the cell range empty for leverage & pip size column ",{"$nulls":5},"CHF/JPY"]
[{"$nulls":12},"PROFIT-LOSS RATIO ",null,null,"Refers to the value of the average profit compared to the value of the average loss per trade.",{"$nulls":9},"   will automatically used the default settings above.",{"$nulls":5},"CHF/RON"]
[{"$nulls":12},"(edge ratio, payoff ratio, edge)",null,null,"Ex. $1,000 average profit / $500 average loss = $1,000/$500 = 2 : 1 RRR",{"$nulls":15},"CHF/TRY"]
[{"$nulls":31},"EUR/AUD"]
[{"$nulls":31},"EUR/CAD"]
[{"$nulls":12},"PROFIT FACTOR ",null,null,"Is an adjusted profit-loss ratio that considers the factor of win%.",{"$nulls":15},"EUR/CHF"]
[{"$nulls":12},"(Adjusted Profit-loss ratio, factor)",null,null,"Ex. Win rate% of 40% with $1000 average profit and $500 average loss",{"$nulls":15},"EUR/CZK"]
[{"$nulls":15},"Formula: (Winrate% x Ave.Profit) / (Lossrate% x Ave.Loss)",{"$nulls":15},"EUR/DKK"]
[{"$nulls":15},"Profit Factor = (40% x $1000) / (60% x $500) = 1.33 Profit Factor",{"$nulls":15},"EUR/GBP"]
[{"$nulls":31},"EUR/HKD"]
[{"$nulls":12},"EXPECTANCY",null,null,"Is defined as how much money, on average, we can expect to make for every trade.",{"$nulls":15},"EUR/HUF"]
[{"$nulls":12},"(Expectancy per trade)",null,null,"Ex. Win rate% of 40% with $1000 average profit and $500 average loss",{"$nulls":15},"EUR/ILS"]
[{"$nulls":15},"Formula: (Winrate% x Ave.Profit) - (Lossrate% x Ave.Loss)",{"$nulls":15},"EUR/JPY"]
[{"$nulls":15},"Expectancy = (40% x $1000) - (60% x $500) = $100",{"$nulls":15},"EUR/MXN"]
[{"$nulls":31},"EUR/NOK"]
[{"$nulls":12},"MAXIMUM DRAWDOWN",null,null,"Is the maximum observed loss from a peak to a trough of a portfolio, before a new peak is attained.",{"$nulls":15},"EUR/NZD"]
[{"$nulls":12},"(MMD)",{"$nulls":18},"EUR/PLN"]
[{"$nulls":31},"EUR/RON"]
[{"$nulls":31},"EUR/RUB"]
[{"$nulls":31},"EUR/SEK"]
[{"$nulls":31},"EUR/SGD"]
[{"$nulls":31},"EUR/TRY"]
[{"$nulls":31},"EUR/USD"]
[{"$nulls":12},"R-MULTIPLE",null,null,"The R stands for Initial Risk. The initial risk is how much are you willing to lose on a single trade.",{"$nulls":15},"EUR/ZAR"]
[{"$nulls":12},"(Risk-multiple, 1R)",null,null,"All profits and losses can be expressed as a multiple of the initial risk R.",{"$nulls":15},"GBP/AUD"]
[{"$nulls":15},"You want your losses to be 1R or less and your profits to be as big as possible.",{"$nulls":15},"GBP/BGN"]
[{"$nulls":15},"Ex. If you set 1R to 1% , a loss of 2R means you lossed 2% of your equity.",{"$nulls":15},"GBP/CAD"]
[{"$nulls":15},"Ex. If you set 1R to 2% , a loss of 2R means you lossed 4% of your equity.",{"$nulls":15},"GBP/CHF"]
[{"$nulls":31},"GBP/CZK"]
[{"$nulls":12},"VAR",null,null,"VAR is the equivalent amount of your 1R",{"$nulls":15},"GBP/DKK"]
[{"$nulls":12},"(Value -at-Risk, 1R)",null,null,"You want your losses to be within VAR or less for each trade.",{"$nulls":15},"GBP/HKD"]
[{"$nulls":15},"Ex. Equity is $100,000, you set 1R to 1% , your VAR for each trade is $1,000. A loss of 2R means you lossed $2,000 ($1,000 x 2).",{"$nulls":15},"GBP/HUF"]
[{"$nulls":15},"Ex. Equity is $100,000, you set 1R to 0.05% , your VAR for each trade is $500. A gain of 4R means you gained $2,000 ($500 x 4).",{"$nulls":15},"GBP/JPY"]
[{"$nulls":31},"GBP/NOK"]
[{"$nulls":12},"1R Allowable Range%",null,null,"A range settings used in \"Risk evaluation chart\" to calculate -+10% from 1R.",{"$nulls":15},"GBP/NZD"]
[{"$nulls":15},"Ex. 1R with 10% allowable range. =  0.9R to 1.1R will be count as 1R.",{"$nulls":15},"GBP/PLN"]
[{"$nulls":31},"GBP/RON"]
[{"$nulls":31},"GBP/SEK"]
[{"$nulls":31},"GBP/SGD"]
[{"$nulls":31},"GBP/TRY"]
[{"$nulls":12},"KELLY CRITERION%",null,null,"Is a money-management formula that calculates the optimal percentage of capital to be put into a single trade.",{"$nulls":15},"GBP/USD"]
[{"$nulls":15},"Ex. Equity is $100,000 , Winrate% is 60%, Loss rate% is 40% and profit loss ratio is 1.4",{"$nulls":15},"GBP/ZAR"]
[{"$nulls":15},"Formula : Kelly Criterion% = (Win rate% –  Loss rate%) / Profit loss ratio",{"$nulls":15},"HKD/JPY"]
[{"$nulls":15},"Kelly Criterion% = (60% – 40%) / 1.4 = 14.3% of Equity or $14,300 position for each trade.",{"$nulls":15},"NZD/CAD"]
[{"$nulls":31},"NZD/CHF"]
[{"$nulls":31},"NZD/JPY"]
[{"$nulls":31},"NZD/USD"]
[{"$nulls":31},"SGD/HKD"]
[{"$nulls":31},"SGD/JPY"]
[{"$nulls":31},"TRY/BGN"]
[{"$nulls":31},"TRY/JPY"]
[{"$nulls":31},"TRY/RON"]
[{"$nulls":31},"USD/BGN"]
[{"$nulls":31},"USD/CAD"]
[{"$nulls":31},"USD/CHF"]
[{"$nulls":31},"USD/CZK"]
[{"$nulls":31},"USD/DKK"]
[{"$nulls":31},"USD/HKD"]
[{"$nulls":31},"USD/HUF"]
[{"$nulls":31},"USD/ILS"]
[{"$nulls":31},"USD/JPY"]
[{"$nulls":31},"USD/MXN"]
[{"$nulls":31},"USD/NOK"]
[{"$nulls":31},"USD/PLN"]
[{"$nulls":31},"USD/RON"]
[{"$nulls":31},"USD/RUB"]
[{"$nulls":31},"USD/SEK"]
[{"$nulls":31},"USD/SGD"]
[{"$nulls":31},"USD/TRY"]
[{"$nulls":31},"USD/ZAR"]
[{"$nulls":31},"AUDCHF"]
[{"$nulls":31},"AUDJPY"]
[{"$nulls":31},"AUDNZD"]
[{"$nulls":31},"AUDUSD"]
[{"$nulls":31},"BGNRON"]
[{"$nulls":31},"CADCHF"]
[{"$nulls":31},"CADJPY"]
[{"$nulls":31},"CHFBGN"]
[{"$nulls":31},"CHFJPY"]
[{"$nulls":31},"CHFRON"]
[{"$nulls":31},"CHFTRY"]
[{"$nulls":31},"EURAUD"]
[{"$nulls":31},"EURCAD"]
[{"$nulls":31},"EURCHF"]
[{"$nulls":31},"EURCZK"]
[{"$nulls":31},"EURDKK"]
[{"$nulls":31},"EURGBP"]
[{"$nulls":31},"EURHKD"]
[{"$nulls":31},"EURHUF"]
[{"$nulls":31},"EURILS"]
[{"$nulls":31},"EURJPY"]
[{"$nulls":31},"EURMXN"]
[{"$nulls":31},"EURNOK"]
[{"$nulls":31},"EURNZD"]
[{"$nulls":31},"EURPLN"]
[{"$nulls":31},"EURRON"]
[{"$nulls":31},"EURRUB"]
[{"$nulls":31},"EURSEK"]
[{"$nulls":31},"EURSGD"]
[{"$nulls":31},"EURTRY"]
[{"$nulls":31},"EURUSD"]
[{"$nulls":31},"EURZAR"]
[{"$nulls":31},"GBPAUD"]
[{"$nulls":31},"GBPBGN"]
[{"$nulls":31},"GBPCAD"]
[{"$nulls":31},"GBPCHF"]
[{"$nulls":31},"GBPCZK"]
[{"$nulls":31},"GBPDKK"]
[{"$nulls":31},"GBPHKD"]
[{"$nulls":31},"GBPHUF"]
[{"$nulls":31},"GBPJPY"]
[{"$nulls":31},"GBPNOK"]
[{"$nulls":31},"GBPNZD"]
[{"$nulls":31},"GBPPLN"]
[{"$nulls":31},"GBPRON"]
[{"$nulls":31},"GBPSEK"]
[{"$nulls":31},"GBPSGD"]
[{"$nulls":31},"GBPTRY"]
[{"$nulls":31},"GBPUSD"]
[{"$nulls":31},"GBPZAR"]
[{"$nulls":31},"HKDJPY"]
[{"$nulls":31},"NZDCAD"]
[{"$nulls":31},"NZDCHF"]
[{"$nulls":31},"NZDJPY"]
[{"$nulls":31},"NZDUSD"]
[{"$nulls":31},"SGDHKD"]
[{"$nulls":31},"SGDJPY"]
[{"$nulls":31},"TRYBGN"]
[{"$nulls":31},"TRYJPY"]
[{"$nulls":31},"TRYRON"]
[{"$nulls":31},"USDBGN"]
[{"$nulls":31},"USDCAD"]
[{"$nulls":31},"USDCHF"]
[{"$nulls":31},"USDCZK"]
[{"$nulls":31},"USDDKK"]
[{"$nulls":31},"USDHKD"]
[{"$nulls":31},"USDHUF"]
[{"$nulls":31},"USDILS"]
[{"$nulls":31},"USDJPY"]
[{"$nulls":31},"USDMXN"]
[{"$nulls":31},"USDNOK"]
[{"$nulls":31},"USDPLN"]
[{"$nulls":31},"USDRON"]
[{"$nulls":31},"USDRUB"]
[{"$nulls":31},"USDSEK"]
[{"$nulls":31},"USDSGD"]
[{"$nulls":31},"USDTRY"]
[{"$nulls":31},"USDZAR"]
[]
[]
[]
[]
[{"$nulls":28},"selection","Wins & Losses"]
[]
[{"$nulls":27},"selection"]
[{"$nulls":27},"Wins & Losses"]
[{"$nulls":27},"Ave.Profit & Loss"]